{"text_format":"1","workbook":"xlsx","n_sheets":12,"sheets":["Instructions","Project Summary","Parcel","SFR","Trail","Road","Lookup","log","BMP Modeling","Infeasibility Criteria","MDC","BMP Sizing"],"not_rendered":{"charts":0,"images":1,"macros":1,"external_links":0,"defined_names":292,"comments":3,"pivot_tables":0},"unopened":[],"bounds":{"document_bytes":16777216,"sheet_cells":100000,"rows_first":2000,"rows_last":500,"rows_between":2000,"halvings":0,"cell_chars":16384,"cell_head_chars":4096},"cells_cut":0,"cells_raw":0,"read":"whole","date_system":"1900"}

{"sheet":"Instructions","index":0,"n_rows":120,"n_cols":6,"rows_kept":120,"cut":false,"hidden":false,"merged":[[0,0,0,41],[7,0,7,41],[1,0,1,41],[4,0,4,41],[5,0,5,41]]}
["On-site Stormwater Management - List Approach Calculator"]
["Instructions"]
["Version 07-28-2017"]
[]
["To use the On-Site List Calculator you must select \"Enable Content\" when the Security Warning appears."]
["Note this calculator is designed to work with Microsoft Excel 2010 or newer"]
{"$rows_left_out":115}
{"sheet":"Project Summary","index":1,"n_rows":91,"n_cols":56,"rows_kept":91,"cut":false,"hidden":false,"merged":[[90,18,90,20],[84,34,84,39],[84,15,84,20],[86,15,86,20],[88,15,88,20],[90,23,91,40],[86,34,86,39],[88,34,88,39],[55,16,55,19],[61,35,61,38],[51,20,51,23],[80,22,80,25],[73,32,73,34],[69,26,69,40],[71,16,71,19],[71,24,71,40],[61,16,61,19],[65,35,65,38],[63,35,63,38],[65,1,66,34],[80,32,80,40],[80,26,80,31],[73,29,73,30],[80,1,80,3],[82,1,82,3],[82,4,82,9],[69,16,69,19],[80,4,80,9],[75,22,79,40],[82,32,82,40],[82,22,82,25],[82,26,82,31],[73,14,73,15],[78,16,78,19],[76,16,76,19],[82,10,82,20],[80,10,80,20],[0,0,0,41],[1,0,1,41],[23,28,23,40],[7,7,7,19],[5,7,5,19],[9,7,9,19],[7,32,7,40],[5,32,5,40],[13,22,13,25],[17,22,17,25],[23,7,23,19],[11,22,11,25],[9,32,9,40],[3,0,3,41],[15,22,15,25],[19,22,19,25],[21,22,21,25],[26,28,26,31],[11,28,21,40],[53,16,53,19],[31,16,31,40],[25,0,25,41],[43,16,43,32],[33,16,33,40],[49,20,49,23],[35,30,35,33],[39,16,39,40],[37,16,37,40],[41,16,41,19],[45,23,45,26]]}
["On-site Stormwater Management - List Approach Calculator "]
["Site and Drainage Control Summary"]
[{"$f":"Version","v":"Version 07-28-2017"}]
["To use the On-Site List Calculator you must select \"Enable Content\" when the Security Warning appears."]
["Project Information",null,null,null,null,null,null,null,null,null,null,null,null,null,null,null,null,null,null,null,null,null,null,null,null,null,null,null,null,null,null,null,null,null,null,null,null,null,null,null,null,null,null,"Hidden Column"]
[null,"Site Address",null,null,null,null,null,null,null,null,null,null,null,null,null,null,null,null,null,null,null,"SDCI Project Number"]
{"$rows_left_out":86}
{"sheet":"Parcel","index":2,"n_rows":77,"n_cols":85,"rows_kept":77,"cut":false,"hidden":true,"merged":[[3,13,3,22],[6,71,13,71],[6,73,13,73],[6,75,13,75],[6,76,13,76],[6,70,13,70],[6,13,6,18],[6,78,13,78],[0,79,0,84],[6,84,13,84],[6,83,13,83],[6,82,13,82],[6,81,13,81],[6,80,13,80],[6,79,13,79],[40,22,40,67],[50,22,50,67],[6,77,13,77],[6,72,13,72],[6,74,13,74],[77,22,77,57],[72,22,72,67],[75,22,75,67],[75,15,75,20],[72,15,72,20],[65,15,65,20],[65,22,65,67],[8,22,8,67],[0,0,0,68],[31,15,31,20],[34,15,34,20],[37,15,37,20],[40,15,40,20],[24,15,24,20],[1,0,1,68],[10,13,10,67],[18,22,18,67],[8,13,8,18],[12,13,12,18],[18,15,18,20],[43,15,43,20],[21,15,21,20],[24,22,24,67],[37,22,37,67],[34,22,34,67],[62,15,62,20],[50,15,50,20],[53,15,53,20],[56,15,56,20],[59,15,59,20],[62,22,62,67],[59,22,59,67],[56,22,56,67],[53,22,53,67],[21,22,21,67],[43,22,43,67],[31,22,31,67]]}
["On-site Stormwater Management - List Approach Calculator",null,null,null,null,null,null,null,null,null,null,null,null,null,null,null,null,null,null,null,null,null,null,null,null,null,null,null,null,null,null,null,null,null,null,null,null,null,null,null,null,null,null,null,null,null,null,null,null,null,null,null,null,null,null,null,null,null,null,null,null,null,null,null,null,null,null,null,null,null,null,null,null,null,null,null,null,"Column to Use",null,"Evaluation Required"]
["Surface Identification and BMP Evaluation for Parcel-Based Projects",null,null,null,null,null,null,null,null,null,null,null,null,null,null,null,null,null,null,null,null,null,null,null,null,null,null,null,null,null,null,null,null,null,null,null,null,null,null,null,null,null,null,null,null,null,null,null,null,null,null,null,null,null,null,null,null,null,null,null,null,null,null,null,null,null,null,null,null,null,"None Feasible",null,null,null,null,{"$f":"AND(COUNTIFS(BT19:BT76,\"Feasibility\",BV19:BV76,TRUE)=COUNTIF(BT19:BT76,\"Feasibility\"),COUNTIF(BX19:BX76,TRUE)=0)","v":false},null,{"$f":"OFFSET(CA2,0,IF($N$9=\"Roof\",0,3)+'Project Summary'!$AS$34)","v":4},null,1,2,3,4,5,6]
[]
[null,"Project No.",null,null,null,null,null,null,null,null,null,null,null,{"$f":"'Project Summary'!$AG$6","v":0},null,null,null,null,null,null,null,null,null,null,null,null,null,null,null,null,null,null,null,null,null,null,null,null,null,null,null,null,null,null,null,null,null,null,null,null,null,null,null,null,null,null,null,null,null,null,null,null,null,null,null,null,null,null,null,null,null,null,null,null,null,null,null,null,null,"Roof","Roof","Roof","Surface","Surface","Surface"]
[]
[]
{"$rows_left_out":72}
{"sheet":"SFR","index":3,"n_rows":80,"n_cols":85,"rows_kept":80,"cut":false,"hidden":true,"merged":[[3,13,3,22],[78,15,78,20],[78,22,78,67],[80,22,80,59],[62,15,62,20],[62,22,62,67],[65,15,65,20],[65,22,65,67],[72,15,72,20],[72,22,72,67],[73,22,73,59],[76,22,76,59],[75,15,75,20],[75,22,75,67],[53,15,53,20],[53,22,53,67],[56,15,56,20],[56,22,56,67],[59,15,59,20],[59,22,59,67],[40,15,40,20],[40,22,40,67],[43,15,43,20],[43,22,43,67],[50,15,50,20],[50,22,50,67],[31,15,31,20],[31,22,31,67],[34,15,34,20],[34,22,34,67],[37,15,37,20],[37,22,37,67],[6,83,13,83],[21,15,21,20],[21,22,21,67],[24,15,24,20],[24,22,24,67],[18,15,18,20],[18,22,18,67],[6,78,13,78],[6,79,13,79],[6,80,13,80],[6,71,13,71],[6,74,13,74],[8,22,8,67],[0,0,0,68],[0,79,0,84],[1,0,1,68],[6,13,6,18],[6,70,13,70],[6,72,13,72],[6,73,13,73],[6,75,13,75],[6,76,13,76],[6,77,13,77],[6,84,13,84],[8,13,8,18],[10,13,10,67],[12,13,12,18],[6,81,13,81],[6,82,13,82]]}
["On-site Stormwater Management - List Approach Calculator",null,null,null,null,null,null,null,null,null,null,null,null,null,null,null,null,null,null,null,null,null,null,null,null,null,null,null,null,null,null,null,null,null,null,null,null,null,null,null,null,null,null,null,null,null,null,null,null,null,null,null,null,null,null,null,null,null,null,null,null,null,null,null,null,null,null,null,null,null,null,null,null,null,null,null,null,"Column to Use",null,"Evaluation Required"]
["Surface Identification and BMP Evaluation for Single Family Residential Projects",null,null,null,null,null,null,null,null,null,null,null,null,null,null,null,null,null,null,null,null,null,null,null,null,null,null,null,null,null,null,null,null,null,null,null,null,null,null,null,null,null,null,null,null,null,null,null,null,null,null,null,null,null,null,null,null,null,null,null,null,null,null,null,null,null,null,null,null,null,"None Feasible",null,null,null,null,{"$f":"AND(COUNTIFS(BT19:BT79,\"Feasibility\",BV19:BV79,TRUE)=COUNTIF(BT19:BT79,\"Feasibility\"),COUNTIF(BX19:BX79,TRUE)=0)","v":false},null,{"$f":"OFFSET(CA2,0,IF($N$9=\"Roof\",0,3)+'Project Summary'!$AS$34)","v":4},null,1,2,3,4,5,6]
[]
[null,"Project No.",null,null,null,null,null,null,null,null,null,null,null,{"$f":"'Project Summary'!$AG$6","v":0},null,null,null,null,null,null,null,null,null,null,null,null,null,null,null,null,null,null,null,null,null,null,null,null,null,null,null,null,null,null,null,null,null,null,null,null,null,null,null,null,null,null,null,null,null,null,null,null,null,null,null,null,null,null,null,null,null,null,null,null,null,null,null,null,null,"Roof","Roof","Roof","Surface","Surface","Surface"]
[]
[]
{"$rows_left_out":75}
{"sheet":"Trail","index":4,"n_rows":43,"n_cols":85,"rows_kept":43,"cut":false,"hidden":true,"merged":[[31,15,31,20],[31,22,31,67],[38,15,38,20],[38,22,38,67],[41,15,41,20],[41,22,41,67],[28,15,28,20],[28,22,28,67],[25,15,25,20],[25,22,25,67],[6,84,13,84],[8,13,8,18],[10,13,10,67],[12,13,12,18],[18,15,18,20],[18,22,18,67],[6,78,13,78],[6,79,13,79],[6,80,13,80],[6,81,13,81],[6,82,13,82],[6,83,13,83],[0,0,0,68],[0,79,0,84],[1,0,1,68],[6,13,6,18],[6,70,13,70],[6,72,13,72],[6,73,13,73],[6,75,13,75],[6,76,13,76],[6,77,13,77],[6,71,13,71],[6,74,13,74],[8,22,8,67],[3,13,3,22]]}
["On-site Stormwater Management - List Approach Calculator",null,null,null,null,null,null,null,null,null,null,null,null,null,null,null,null,null,null,null,null,null,null,null,null,null,null,null,null,null,null,null,null,null,null,null,null,null,null,null,null,null,null,null,null,null,null,null,null,null,null,null,null,null,null,null,null,null,null,null,null,null,null,null,null,null,null,null,null,null,null,null,null,null,null,null,null,"Column to Use",null,"Evaluation Required"]
["Surface Identification and BMP Evaluation for Trail and Sidewalk Projects",null,null,null,null,null,null,null,null,null,null,null,null,null,null,null,null,null,null,null,null,null,null,null,null,null,null,null,null,null,null,null,null,null,null,null,null,null,null,null,null,null,null,null,null,null,null,null,null,null,null,null,null,null,null,null,null,null,null,null,null,null,null,null,null,null,null,null,null,null,"None Feasible",null,null,null,null,{"$f":"AND(COUNTIFS(BT19:BT42,\"Feasibility\",BV19:BV42,TRUE)=COUNTIF(BT19:BT42,\"Feasibility\"),COUNTIF(BX19:BX42,TRUE)=0)","v":false},null,{"$f":"OFFSET(CA2,0,IF($N$9=\"Roof\",0,3)+'Project Summary'!$AS$34)","v":4},null,1,2,3,4,5,6]
[]
[null,"Project No.",null,null,null,null,null,null,null,null,null,null,null,{"$f":"'Project Summary'!$AG$6","v":0},null,null,null,null,null,null,null,null,null,null,null,null,null,null,null,null,null,null,null,null,null,null,null,null,null,null,null,null,null,null,null,null,null,null,null,null,null,null,null,null,null,null,null,null,null,null,null,null,null,null,null,null,null,null,null,null,null,null,null,null,null,null,null,null,null,"Roof","Roof","Roof","Surface","Surface","Surface"]
[]
[]
{"$rows_left_out":38}
{"sheet":"Road","index":5,"n_rows":44,"n_cols":85,"rows_kept":44,"cut":false,"hidden":true,"merged":[[3,13,3,23],[34,15,34,20],[34,22,34,67],[41,15,41,20],[41,22,41,67],[28,15,28,20],[28,22,28,67],[31,15,31,20],[31,22,31,67],[6,84,13,84],[8,13,8,18],[12,13,12,18],[18,15,18,20],[18,22,18,67],[6,78,13,78],[6,79,13,79],[6,80,13,80],[6,81,13,81],[6,82,13,82],[6,83,13,83],[6,74,13,74],[8,22,8,67],[10,13,10,20],[43,22,43,67],[43,15,43,20],[0,0,0,68],[0,79,0,84],[1,0,1,68],[6,13,6,18],[6,70,13,70],[6,72,13,72],[6,73,13,73],[6,75,13,75],[6,76,13,76],[6,77,13,77],[6,71,13,71],[10,24,10,67],[25,15,25,20],[25,22,25,67]]}
["On-site Stormwater Management - List Approach Calculator",null,null,null,null,null,null,null,null,null,null,null,null,null,null,null,null,null,null,null,null,null,null,null,null,null,null,null,null,null,null,null,null,null,null,null,null,null,null,null,null,null,null,null,null,null,null,null,null,null,null,null,null,null,null,null,null,null,null,null,null,null,null,null,null,null,null,null,null,null,null,null,null,null,null,null,null,"Column to Use",null,"Evaluation Required"]
["Surface Identification and BMP Evaluation for Roadway Projects",null,null,null,null,null,null,null,null,null,null,null,null,null,null,null,null,null,null,null,null,null,null,null,null,null,null,null,null,null,null,null,null,null,null,null,null,null,null,null,null,null,null,null,null,null,null,null,null,null,null,null,null,null,null,null,null,null,null,null,null,null,null,null,null,null,null,null,null,null,"None Feasible",null,null,null,null,{"$f":"AND(COUNTIFS(BT19:BT44,\"Feasibility\",BV19:BV44,TRUE)=COUNTIF(BT19:BT44,\"Feasibility\"),COUNTIF(BX19:BX44,TRUE)=0)","v":false},null,{"$f":"OFFSET(CA2,0,IF($N$9=\"Roof\",0,3)+'Project Summary'!$AS$34)","v":4},null,1,2,3,4,5,6]
[]
[null,"Project No.",null,null,null,null,null,null,null,null,null,null,null,{"$f":"'Project Summary'!$AG$6","v":0},null,null,null,null,null,null,null,null,null,null,null,null,null,null,null,null,null,null,null,null,null,null,null,null,null,null,null,null,null,null,null,null,null,null,null,null,null,null,null,null,null,null,null,null,null,null,null,null,null,null,null,null,null,null,null,null,null,null,null,null,null,null,null,null,null,"Roof","Roof","Roof","Surface","Surface","Surface"]
[]
[]
{"$rows_left_out":39}
{"sheet":"Lookup","index":6,"n_rows":249,"n_cols":45,"rows_kept":249,"cut":false,"hidden":true,"merged":[]}
["Project Type","Surface Type","BMP Feasibility","Ponding Depths","Side slopes","YesNo","Check","No Eval","Drainage Basin","Basin + Capacity Constrained","On-Site List Lookup Column","Sheet Name","Infeasible Infiltration","Flow Control Std","Empty List","Environmentally Critical Areas","Dispersion Infeasible","Infiltration Investigation No","Infiltration Investigation Yes","Infiltration Infeasible","ROW Surface List","Approved Point of Stormwater Discharge","Approved Point of Sub Discharge","Approved Point of Wastewater Discharge","Does Not Apply"]
["Single-Family Residential","Roof","-",6,"Vertical","Yes",null,"Not Evaluated","Listed Creek Basin","Listed Creek BasinYes",1,"SFR","Infeasible","Pre-Developed Pasture Standard",{"$f":"\"\"","v":""},"No","Site cannot meet required horizontal setbacks ","Site is mapped as \"infltr. investigation not required\"","Simple infiltration test","Site cannot meet required horizontal setbacks","ROW","Public Storm Drain Main ","Public Storm Drain Main ","Public Sanitary Sewer Main","Does Not Apply for Roadway or Trail and Sidewalk projects"]
["Trail and Sidewalk","Non-Roof","Infeasible",12,"3H:1V","No","✓","Evaluation not required for roof.","Non-listed Creek Basin","Non-listed Creek BasinYes",1,"Trail","Infiltration is infeasible on site.","Peak Control Standard",null,"Geologic Hazard/ Steep Slope Area","Site constraints make dispersion infeasible","Other","Small PIT test","Site cannot meet required vertical separation requirements","Alley","Drainage Ditch","Drainage Ditch","Public Combined Sewer Main"]
["Parcel-Based",null,"Use BMP",null,null,null,null,"Evaluation not required for other surfaces.","Designated Receiving Water","Designated Receiving WaterYes",2,"Parcel","Dispersion is infeasible","Pre-Developed Pasture and Peak Control Standard",null,"Flood-prone Area","Site cannot meet flow path requirements ",null,"Large PIT test","Site constraints make infiltration infeasible","Arterial Street or Collector","Drainage Culvert","Drainage Culvert","Existing Septic System (King County Public Health Department Approval Required)"]
["Roadway",null,"Not Evaluated",null,null,null,null,null,"Combined Sewer Service Area","Combined Sewer Service AreaYes",2,"Road",null,"Pre-Developed Forest Standard",null,"Wetland","One or more of the infeasibility criteria for “All Dispersion BMPs” (Appendix C, Table C.1) apply.",null,"Deep infiltration test","Measured infl rate is less than 0.3 inch/hour","Roadway","Curb Weep Hole","Direct to Receiving Water"]
[null,null,"None Feasible",null,null,null,null,null,"Small Lake Basins","Small Lake BasinsYes",1,null,null,"Pre-Developed Forest and Peak Control Standard",null,"Fish and Wildlife Conservation Area",null,null,null,"Infeasibility criteria for “All Infiltration BMPs” applies","Other","Alley Surface Drain","Wetland"]
{"$rows_left_out":244}
{"sheet":"log","index":7,"n_rows":0,"n_cols":0,"rows_kept":0,"cut":false,"hidden":true,"merged":[]}

{"sheet":"BMP Modeling","index":8,"n_rows":50,"n_cols":29,"rows_kept":50,"cut":false,"hidden":true,"merged":[[13,28,13,56],[15,28,15,56],[17,28,17,56],[19,28,19,56],[21,28,21,56],[0,0,0,57],[1,0,1,57],[13,14,13,18],[7,28,7,56],[9,28,9,56],[11,28,11,56],[9,14,9,18],[11,14,11,18],[7,7,7,13],[7,14,7,18],[21,21,21,25],[11,1,11,2],[13,1,13,2],[13,21,13,25],[15,1,15,2],[15,21,15,25],[31,7,31,13],[29,3,29,6],[29,14,29,18],[29,1,29,2],[4,1,6,55],[23,28,23,56],[25,28,25,56],[27,28,27,56],[23,14,23,18],[25,14,25,18],[27,14,27,18],[27,3,27,6],[9,3,9,6],[11,3,11,6],[13,3,13,6],[15,3,15,6],[17,3,17,6],[19,3,19,6],[21,3,21,6],[23,3,23,6],[25,3,25,6],[15,14,15,18],[17,14,17,18],[19,14,19,18],[37,1,37,2],[33,28,33,56],[35,3,35,6],[35,14,35,18],[35,28,35,56],[33,7,33,13],[35,7,35,13],[33,3,33,6],[33,14,33,18],[45,1,45,2],[41,28,41,56],[43,3,43,6],[43,14,43,18],[43,28,43,56],[41,7,41,13],[43,7,43,13],[41,3,41,6],[41,14,41,18],[45,28,45,56],[47,3,47,6],[47,14,47,18],[47,28,47,56],[45,7,45,13],[47,7,47,13],[45,21,45,25],[45,3,45,6],[45,14,45,18],[37,28,37,56],[39,3,39,6],[39,14,39,18],[39,28,39,56],[37,7,37,13],[39,7,39,13],[37,21,37,25],[37,3,37,6],[37,14,37,18],[29,28,29,56],[31,3,31,6],[31,14,31,18],[31,28,31,56],[9,1,9,2],[9,21,9,25],[11,21,11,25],[17,1,17,2],[25,7,25,13],[27,7,27,13],[29,7,29,13],[29,21,29,25],[19,7,19,13],[21,7,21,13],[23,7,23,13],[13,7,13,13],[15,7,15,13],[17,7,17,13],[9,7,9,13],[11,7,11,13],[21,14,21,18],[19,1,19,2],[19,21,19,25],[21,1,21,2],[47,1,47,2],[47,21,47,25],[7,21,7,25],[7,0,7,2],[7,3,7,6],[39,1,39,2],[39,21,39,25],[41,1,41,2],[41,21,41,25],[43,1,43,2],[43,21,43,25],[31,1,31,2],[31,21,31,25],[33,1,33,2],[33,21,33,25],[35,1,35,2],[35,21,35,25],[23,1,23,2],[23,21,23,25],[25,1,25,2],[25,21,25,25],[27,1,27,2],[27,21,27,25],[17,21,17,25]]}
["On-site Stormwater Management - List Approach Calculator"]
["BMP Modeling"]
[{"$f":"Version","v":"Version 07-28-2017"}]
[]
[null,"For the On-Site Performance Standard the modeling approach for each BMP design shall be applied. Refer to Section 4.1.3 and Appendix F in the Seattle Stormwater Manual for modeling requirements and guidelines."]
[]
{"$rows_left_out":45}
{"sheet":"Infeasibility Criteria","index":9,"n_rows":249,"n_cols":11,"rows_kept":249,"cut":false,"hidden":false,"merged":[[0,0,0,3]]}
["On-site Stormwater Management - List Approach Calculator"]
[null,null,"Infeasibility Criteria"]
[{"$f":"Version","v":"Version 07-28-2017"}]
[]
["Infeasibility Criteria"]
[null,"Full Dispersion"]
{"$rows_left_out":244}
{"sheet":"MDC","index":10,"n_rows":40,"n_cols":35,"rows_kept":40,"cut":false,"hidden":false,"merged":[[16,14,16,30],[0,0,0,31],[1,0,1,31],[5,14,5,30],[6,14,6,30],[7,14,7,30],[9,17,9,21],[10,17,10,21],[11,17,11,21],[12,17,12,21],[13,17,13,21],[15,14,15,30],[17,14,17,30],[18,14,18,30],[19,14,19,30],[20,14,20,30],[21,1,21,12],[21,14,21,30],[23,1,24,13],[23,14,24,30],[19,1,19,13],[27,1,27,2],[27,4,27,8],[27,9,27,15],[27,16,27,18],[27,20,27,22],[27,24,27,31],[22,14,22,30],[26,9,26,15],[26,16,26,19],[26,20,26,23],[26,24,26,31],[29,24,29,31],[28,1,28,2],[28,4,28,8],[28,9,28,15],[28,16,28,18],[28,20,28,22],[28,24,28,31],[29,1,29,2],[29,4,29,8],[29,9,29,15],[29,16,29,18],[29,20,29,22],[31,24,31,31],[30,1,30,2],[30,4,30,8],[30,9,30,15],[30,16,30,18],[30,20,30,22],[30,24,30,31],[31,1,31,2],[31,4,31,8],[31,9,31,15],[31,16,31,18],[31,20,31,22],[33,24,33,31],[32,1,32,2],[32,4,32,8],[32,9,32,15],[32,16,32,18],[32,20,32,22],[32,24,32,31],[33,1,33,2],[33,4,33,8],[33,9,33,15],[33,16,33,18],[33,20,33,22],[35,24,35,31],[34,1,34,2],[34,4,34,8],[34,9,34,15],[34,16,34,18],[34,20,34,22],[34,24,34,31],[35,1,35,2],[35,4,35,8],[35,9,35,15],[35,16,35,18],[35,20,35,22],[37,24,37,31],[36,1,36,2],[36,4,36,8],[36,9,36,15],[36,16,36,18],[36,20,36,22],[36,24,36,31],[37,1,37,2],[37,4,37,8],[37,9,37,15],[37,16,37,18],[37,20,37,22],[38,24,38,31],[39,16,39,17],[38,1,38,2],[38,4,38,8],[38,9,38,15],[38,16,38,18],[38,20,38,22]]}
["Memorandum of Drainage Control "]
["Exhibit A: On-site Stormwater Management Summary Sheet"]
["This information is taken from the Drainage Control Plan approved as part of a building, site work or master use plan."]
[]
["Project Information"]
[null,"Site Address",null,null,null,null,null,null,null,null,null,null,null,null,{"$f":"'Project Summary'!H6","v":0}]
{"$rows_left_out":35}
{"sheet":"BMP Sizing","index":11,"n_rows":207,"n_cols":46,"rows_kept":207,"cut":false,"hidden":true,"merged":[[90,7,90,11],[98,7,98,11],[106,7,106,11],[114,7,114,11],[122,7,122,11],[130,7,130,11],[138,7,138,11],[146,7,146,11],[154,7,154,11],[120,1,120,12],[136,1,136,12],[128,1,128,12],[204,13,204,20],[204,21,204,26],[206,13,206,20],[206,21,206,26],[196,13,196,20],[196,21,196,26],[198,13,198,20],[198,21,198,26],[200,1,200,12],[200,13,200,20],[200,21,200,26],[202,7,202,11],[200,28,200,36],[202,13,202,20],[202,21,202,26],[202,28,202,36],[188,13,188,20],[188,21,188,26],[190,13,190,20],[190,21,190,26],[192,1,192,12],[192,13,192,20],[192,21,192,26],[192,28,192,36],[194,13,194,20],[194,21,194,26],[194,28,194,36],[194,7,194,11],[180,13,180,20],[180,21,180,26],[182,13,182,20],[182,21,182,26],[184,1,184,12],[184,13,184,20],[184,21,184,26],[184,28,184,36],[186,13,186,20],[186,21,186,26],[186,28,186,36],[186,7,186,11],[172,13,172,20],[172,21,172,26],[174,13,174,20],[174,21,174,26],[176,1,176,12],[176,13,176,20],[176,21,176,26],[176,28,176,36],[178,13,178,20],[178,21,178,26],[178,28,178,36],[178,7,178,11],[164,13,164,20],[164,21,164,26],[166,13,166,20],[166,21,166,26],[168,1,168,12],[168,13,168,20],[168,21,168,26],[168,28,168,36],[170,13,170,20],[170,21,170,26],[170,28,170,36],[170,7,170,11],[156,13,156,20],[156,21,156,26],[158,13,158,20],[158,21,158,26],[160,1,160,12],[160,13,160,20],[160,21,160,26],[160,28,160,36],[162,13,162,20],[162,21,162,26],[162,28,162,36],[162,7,162,11],[148,13,148,20],[148,21,148,26],[150,13,150,20],[150,21,150,26],[152,1,152,12],[152,13,152,20],[152,21,152,26],[152,28,152,36],[154,13,154,20],[154,21,154,26],[154,28,154,36],[142,13,142,20],[142,21,142,26],[144,1,144,12],[144,13,144,20],[144,21,144,26],[144,28,144,36],[146,13,146,20],[146,21,146,26],[146,28,146,36],[114,21,114,26],[116,21,116,26],[116,13,116,20],[102,13,102,20],[136,28,136,36],[138,13,138,20],[138,21,138,26],[138,28,138,36],[140,13,140,20],[140,21,140,26],[102,21,102,26],[110,13,110,20],[110,21,110,26],[118,13,118,20],[108,21,108,26],[108,13,108,20],[114,13,114,20],[132,13,132,20],[132,21,132,26],[134,13,134,20],[134,21,134,26],[136,13,136,20],[136,21,136,26],[120,21,120,26],[122,13,122,20],[122,21,122,26],[120,13,120,20],[58,28,58,36],[66,28,66,36],[74,28,74,36],[82,28,82,36],[90,28,90,36],[98,28,98,36],[122,28,122,36],[112,28,112,36],[120,28,120,36],[106,28,106,36],[114,28,114,36],[106,21,106,26],[98,13,98,20],[118,21,118,26],[72,28,72,36],[80,28,80,36],[88,28,88,36],[96,28,96,36],[104,28,104,36],[78,21,78,26],[82,13,82,20],[130,13,130,20],[130,21,130,26],[130,28,130,36],[128,13,128,20],[128,21,128,26],[128,28,128,36],[124,21,124,26],[124,13,124,20],[126,13,126,20],[126,21,126,26],[50,28,50,36],[30,1,30,4],[30,5,30,8],[30,10,30,25],[30,26,30,37],[32,1,32,4],[32,5,32,8],[32,10,32,25],[32,26,32,37],[34,1,34,4],[34,5,34,8],[34,10,34,25],[34,26,34,37],[38,10,38,25],[38,26,38,37],[40,1,40,4],[40,5,40,8],[40,10,40,25],[40,26,40,37],[42,1,42,4],[44,5,44,8],[44,10,44,25],[44,26,44,37],[44,1,44,4],[4,10,4,24],[36,1,36,4],[36,5,36,8],[36,10,36,25],[36,26,36,37],[38,1,38,4],[38,5,38,8],[24,5,24,8],[12,5,12,8],[14,5,14,8],[16,5,16,8],[18,26,18,37],[20,26,20,37],[22,26,22,37],[24,10,24,25],[28,10,28,25],[26,10,26,25],[26,26,26,37],[28,1,28,4],[28,5,28,8],[24,26,24,37],[96,21,96,26],[88,13,88,20],[96,13,96,20],[94,13,94,20],[94,21,94,26],[90,13,90,20],[92,13,92,20],[104,21,104,26],[98,21,98,26],[0,0,0,37],[1,0,1,37],[3,1,3,36],[45,5,45,7],[4,1,4,4],[6,1,6,4],[8,1,8,4],[10,1,10,4],[12,1,12,4],[14,1,14,4],[16,1,16,4],[18,1,18,4],[20,1,20,4],[22,1,22,4],[24,1,24,4],[22,5,22,8],[42,5,42,8],[42,10,42,25],[8,10,8,25],[22,10,22,25],[20,10,20,25],[18,5,18,8],[26,1,26,4],[26,5,26,8],[48,1,48,12],[56,1,56,12],[54,13,54,20],[54,21,54,26],[62,13,62,20],[62,21,62,26],[52,21,52,26],[60,21,60,26],[58,13,58,20],[59,13,59,20],[52,13,52,20],[50,7,50,11],[58,7,58,11],[56,28,56,36],[64,28,64,36],[42,26,42,37],[4,5,4,8],[6,5,6,8],[8,5,8,8],[10,5,10,8],[20,5,20,8],[50,13,50,20],[48,21,48,26],[48,13,48,20],[50,21,50,26],[6,26,6,37],[8,26,8,37],[10,26,10,37],[12,26,12,37],[14,26,14,37],[16,26,16,37],[18,10,18,25],[16,10,16,25],[14,10,14,25],[12,10,12,25],[10,10,10,25],[28,26,28,37],[48,28,48,36],[6,10,6,25],[112,1,112,12],[112,13,112,20],[112,21,112,26],[104,13,104,20],[106,13,106,20],[104,1,104,12],[96,1,96,12],[72,1,72,12],[74,13,74,20],[74,21,74,26],[76,21,76,26],[80,1,80,12],[72,21,72,26],[76,13,76,20],[100,21,100,26],[100,13,100,20],[88,21,88,26],[92,21,92,26],[90,21,90,26],[82,21,82,26],[84,21,84,26],[78,13,78,20],[88,1,88,12],[80,21,80,26],[86,13,86,20],[86,21,86,26],[84,13,84,20],[66,13,66,20],[56,21,56,26],[64,21,64,26],[56,13,56,20],[64,13,64,20],[68,13,68,20],[60,13,60,20],[72,13,72,20],[58,21,58,26],[66,21,66,26],[70,21,70,26],[68,21,68,26],[70,13,70,20],[80,13,80,20],[64,1,64,12],[66,7,66,11],[74,7,74,11],[82,7,82,11]]}
["On-site Stormwater Management - List Approach Calculator"]
["BMP Sizing"]
[{"$f":"Version","v":"Version 07-28-2017"}]
[null,"\nMore than one surface can drain to the same BMP. For example, a garage roof and driveway may be managed by a single infiltration trench. Please indicate which surfaces are draining to which BMPs in the dropdown menus."]
[null,"Surface",null,null,null,"Area (sf)",null,null,null,null,"Select BMP",null,null,null,null,null,null,null,null,null,null,null,null,null,null,null,null,null,null,null,null,null,null,null,null,null,null,null,null,"Dropdown List","Unique Count","BMP Type","Can there be more than one BMP","Match"]
[]
{"$rows_left_out":201}