{"text_format":"1","workbook":"xlsx","n_sheets":10,"sheets":["Instructions","Project Summary","Trail","Road","Parcel","log","Lookup","BMP Modeling","BMP Sizing","Infeasibility Criteria"],"not_rendered":{"charts":0,"images":2,"macros":1,"external_links":0,"defined_names":428,"comments":0,"pivot_tables":0},"unopened":[],"bounds":{"document_bytes":16777216,"sheet_cells":100000,"rows_first":2000,"rows_last":500,"rows_between":2000,"halvings":0,"cell_chars":16384,"cell_head_chars":4096},"cells_cut":0,"cells_raw":0,"read":"whole","date_system":"1900"}

{"sheet":"Instructions","index":0,"n_rows":165,"n_cols":6,"rows_kept":165,"cut":false,"hidden":false,"merged":[[0,0,0,41],[7,0,7,41],[1,0,1,41],[4,0,4,41],[5,0,5,41]]}
["On-site Stormwater Management Calculator"]
["Instructions"]
["Version 05-22-2026"]
[]
["To use the On-Site Stormwater Calculator you must select \"Enable Content\" when the Security Warning appears."]
["Note this calculator is designed to work with Microsoft Excel 2010 or newer."]
{"$rows_left_out":160}
{"sheet":"Project Summary","index":1,"n_rows":84,"n_cols":56,"rows_kept":84,"cut":false,"hidden":false,"merged":[[19,18,19,21],[78,1,78,3],[78,4,78,9],[76,4,76,9],[50,36,50,39],[32,1,32,40],[40,19,40,40],[61,16,61,19],[76,1,76,3],[72,20,75,41],[46,20,46,23],[53,36,53,39],[50,24,51,35],[53,24,54,35],[78,10,78,20],[78,32,78,40],[29,18,29,21],[78,26,78,31],[56,36,56,39],[76,32,76,40],[0,0,0,41],[1,0,1,41],[7,7,7,19],[5,7,5,19],[9,7,9,19],[7,32,7,40],[5,32,5,40],[9,32,9,40],[3,0,3,41],[15,35,15,40],[21,18,21,21],[23,18,23,21],[19,36,19,39],[17,22,17,25],[19,25,23,35],[25,36,25,39],[25,25,29,35],[83,23,83,40],[72,16,72,19],[76,10,76,20],[76,26,76,31],[76,22,76,25],[74,16,74,19],[82,37,82,39],[82,14,82,19],[80,34,80,39],[80,14,80,19],[78,22,78,25],[13,32,13,40],[38,30,38,33],[27,18,27,21],[63,14,63,15],[53,18,53,21],[50,18,50,21],[63,32,63,34],[59,26,59,40],[61,24,61,40],[34,16,34,40],[36,16,36,40],[31,6,31,24],[56,21,56,24],[59,16,59,19],[63,29,63,30],[25,18,25,21]]}
["On-site Stormwater Management Calculator "]
["Site and Drainage Control Summary"]
[{"$f":"Version","v":"Version 05-22-2026"}]
["To use the On-Site List Calculator you must select \"Enable Content\" when the Security Warning appears."]
["Project Information",null,null,null,null,null,null,null,null,null,null,null,null,null,null,null,null,null,null,null,null,null,null,null,null,null,null,null,null,null,null,null,null,null,null,null,null,null,null,null,null,null,null,"Hidden Column"]
[null,"Site Address",null,null,null,null,null,null,null,null,null,null,null,null,null,null,null,null,null,null,null,"SDCI Project Number"]
{"$rows_left_out":79}
{"sheet":"Trail","index":2,"n_rows":59,"n_cols":85,"rows_kept":59,"cut":false,"hidden":true,"merged":[[0,0,0,68],[0,79,0,84],[1,0,1,68],[6,13,6,20],[6,70,13,70],[6,72,13,72],[6,73,13,73],[6,75,13,75],[6,76,13,76],[6,77,13,77],[6,71,13,71],[6,74,13,74],[8,24,8,67],[3,13,3,24],[25,17,25,22],[25,24,25,67],[6,84,13,84],[8,13,8,20],[10,13,10,67],[12,13,12,20],[18,17,18,22],[18,24,18,67],[6,78,13,78],[6,79,13,79],[6,80,13,80],[6,81,13,81],[6,82,13,82],[6,83,13,83],[28,17,28,22],[28,24,28,67],[57,17,57,22],[57,24,57,67],[37,17,37,22],[37,24,37,67],[47,17,47,22],[47,24,47,67],[50,17,50,22],[50,24,50,67],[40,17,40,22],[40,24,40,67],[34,17,34,22],[34,24,34,67],[31,17,31,22],[31,24,31,67]]}
["On-site Stormwater Management Calculator - List Approach",null,null,null,null,null,null,null,null,null,null,null,null,null,null,null,null,null,null,null,null,null,null,null,null,null,null,null,null,null,null,null,null,null,null,null,null,null,null,null,null,null,null,null,null,null,null,null,null,null,null,null,null,null,null,null,null,null,null,null,null,null,null,null,null,null,null,null,null,null,null,null,null,null,null,null,null,"Column to Use",null,"Evaluation Required"]
["Surface Identification and BMP Evaluation for Trail and Sidewalk Projects",null,null,null,null,null,null,null,null,null,null,null,null,null,null,null,null,null,null,null,null,null,null,null,null,null,null,null,null,null,null,null,null,null,null,null,null,null,null,null,null,null,null,null,null,null,null,null,null,null,null,null,null,null,null,null,null,null,null,null,null,null,null,null,null,null,null,null,null,null,"None Feasible",null,null,null,null,{"$f":"AND(COUNTIFS(BT19:BT58,\"Feasibility\",BV19:BV58,TRUE)=COUNTIF(BT19:BT58,\"Feasibility\"),COUNTIF(BX19:BX58,TRUE)=0)","v":false},null,{"$f":"OFFSET(CA2,0,IF($N$9=\"Roof\",0,3)+'Project Summary'!$AS$37)","v":4},null,1,2,3,4,5,6]
[]
[null,"Project No.",null,null,null,null,null,null,null,null,null,null,null,{"$f":"'Project Summary'!$AG$6","v":0},null,null,null,null,null,null,null,null,null,null,null,null,null,null,null,null,null,null,null,null,null,null,null,null,null,null,null,null,null,null,null,null,null,null,null,null,null,null,null,null,null,null,null,null,null,null,null,null,null,null,null,null,null,null,null,null,null,null,null,null,null,null,null,null,null,"Roof","Roof","Roof","Surface","Surface","Surface"]
[]
[]
{"$rows_left_out":54}
{"sheet":"Road","index":3,"n_rows":62,"n_cols":85,"rows_kept":62,"cut":false,"hidden":true,"merged":[[0,0,0,68],[0,79,0,84],[1,0,1,68],[6,13,6,20],[6,70,13,70],[6,72,13,72],[6,73,13,73],[6,75,13,75],[6,76,13,76],[6,77,13,77],[6,71,13,71],[6,84,13,84],[8,13,8,20],[12,13,12,20],[6,82,13,82],[6,83,13,83],[52,24,52,67],[52,17,52,22],[18,24,18,67],[31,17,31,22],[25,17,25,22],[34,24,34,67],[18,17,18,22],[31,24,31,67],[34,17,34,22],[6,80,13,80],[10,13,10,23],[6,81,13,81],[6,74,13,74],[8,24,8,67],[10,25,10,67],[6,78,13,78],[6,79,13,79],[61,17,61,22],[61,24,61,67],[3,13,3,25],[40,17,40,22],[40,24,40,67],[50,17,50,22],[50,24,50,67],[28,17,28,22],[28,24,28,67],[37,17,37,22],[37,24,37,67],[43,17,43,22],[43,24,43,67],[25,24,25,67],[59,17,59,22],[59,24,59,67]]}
["On-site Stormwater Management Calculator - List Approach",null,null,null,null,null,null,null,null,null,null,null,null,null,null,null,null,null,null,null,null,null,null,null,null,null,null,null,null,null,null,null,null,null,null,null,null,null,null,null,null,null,null,null,null,null,null,null,null,null,null,null,null,null,null,null,null,null,null,null,null,null,null,null,null,null,null,null,null,null,null,null,null,null,null,null,null,"Column to Use",null,"Evaluation Required"]
["Surface Identification and BMP Evaluation for Roadway Projects",null,null,null,null,null,null,null,null,null,null,null,null,null,null,null,null,null,null,null,null,null,null,null,null,null,null,null,null,null,null,null,null,null,null,null,null,null,null,null,null,null,null,null,null,null,null,null,null,null,null,null,null,null,null,null,null,null,null,null,null,null,null,null,null,null,null,null,null,null,"None Feasible",null,null,null,null,{"$f":"AND(COUNTIFS(BT19:BT60,\"Feasibility\",BV19:BV60,TRUE)=COUNTIF(BT19:BT60,\"Feasibility\"),COUNTIF(BX19:BX60,TRUE)=0)","v":false},null,{"$f":"OFFSET(CA2,0,IF($N$9=\"Roof\",0,3)+'Project Summary'!$AS$37)","v":4},null,1,2,3,4,5,6]
[]
[null,"Project No.",null,null,null,null,null,null,null,null,null,null,null,{"$f":"'Project Summary'!$AG$6","v":0},null,null,null,null,null,null,null,null,null,null,null,null,null,null,null,null,null,null,null,null,null,null,null,null,null,null,null,null,null,null,null,null,null,null,null,null,null,null,null,null,null,null,null,null,null,null,null,null,null,null,null,null,null,null,null,null,null,null,null,null,null,null,null,null,null,"Roof","Roof","Roof","Surface","Surface","Surface"]
[]
[]
{"$rows_left_out":57}
{"sheet":"Parcel","index":4,"n_rows":102,"n_cols":85,"rows_kept":102,"cut":false,"hidden":true,"merged":[[0,0,0,68],[34,17,34,22],[37,17,37,22],[27,17,27,22],[43,17,43,22],[24,17,24,22],[1,0,1,68],[10,13,10,67],[18,24,18,67],[8,13,8,20],[12,13,12,20],[18,17,18,22],[21,17,21,22],[24,24,24,67],[27,24,27,67],[37,24,37,67],[100,17,100,22],[97,17,97,22],[87,17,87,22],[87,24,87,67],[8,24,8,67],[46,17,46,22],[75,17,75,22],[59,17,59,22],[62,17,62,22],[65,17,65,22],[68,17,68,22],[75,24,75,67],[68,24,68,67],[65,24,65,67],[62,24,62,67],[21,24,21,67],[6,77,13,77],[6,72,13,72],[6,74,13,74],[102,24,102,59],[97,24,97,67],[100,24,100,67],[46,24,46,67],[34,24,34,67],[6,71,13,71],[6,73,13,73],[6,75,13,75],[6,76,13,76],[6,70,13,70],[6,78,13,78],[0,79,0,84],[6,84,13,84],[6,83,13,83],[6,82,13,82],[6,81,13,81],[6,80,13,80],[6,79,13,79],[3,13,3,24],[6,13,6,20],[43,24,43,67],[59,24,59,67],[81,17,81,22],[81,24,81,67],[40,17,40,22],[40,24,40,67],[56,17,56,22],[56,24,56,67],[78,17,78,22],[78,24,78,67],[90,17,90,22],[90,24,90,67],[49,17,49,22],[49,24,49,67],[84,17,84,22],[84,24,84,67]]}
["On-site Stormwater Management Calculator - List Approach",null,null,null,null,null,null,null,null,null,null,null,null,null,null,null,null,null,null,null,null,null,null,null,null,null,null,null,null,null,null,null,null,null,null,null,null,null,null,null,null,null,null,null,null,null,null,null,null,null,null,null,null,null,null,null,null,null,null,null,null,null,null,null,null,null,null,null,null,null,null,null,null,null,null,null,null,"Column to Use",null,"Evaluation Required"]
["Surface Identification and BMP Evaluation for Parcel-Based Projects",null,null,null,null,null,null,null,null,null,null,null,null,null,null,null,null,null,null,null,null,null,null,null,null,null,null,null,null,null,null,null,null,null,null,null,null,null,null,null,null,null,null,null,null,null,null,null,null,null,null,null,null,null,null,null,null,null,null,null,null,null,null,null,null,null,null,null,null,null,"None Feasible",null,null,null,null,{"$f":"AND(COUNTIFS(BT19:BT101,\"Feasibility\",BV19:BV101,TRUE)=COUNTIF(BT19:BT101,\"Feasibility\"),COUNTIF(BX19:BX101,TRUE)=0)","v":false},null,{"$f":"OFFSET(CA2,0,IF($N$9=\"Roof\",0,3)+'Project Summary'!$AS$37)","v":4},null,1,2,3,4,5,6]
[]
[null,"Project No.",null,null,null,null,null,null,null,null,null,null,null,{"$f":"'Project Summary'!$AG$6","v":0},null,null,null,null,null,null,null,null,null,null,null,null,null,null,null,null,null,null,null,null,null,null,null,null,null,null,null,null,null,null,null,null,null,null,null,null,null,null,null,null,null,null,null,null,null,null,null,null,null,null,null,null,null,null,null,null,null,null,null,null,null,null,null,null,null,"Roof","Roof","Roof","Surface","Surface","Surface"]
[]
[]
{"$rows_left_out":97}
{"sheet":"log","index":5,"n_rows":0,"n_cols":0,"rows_kept":0,"cut":false,"hidden":true,"merged":[]}

{"sheet":"Lookup","index":6,"n_rows":407,"n_cols":25,"rows_kept":407,"cut":false,"hidden":true,"merged":[]}
["Project Type","Surface Type","BMP Feasibility","Ponding Depths","Side slopes","YesNo","Check","No Eval","Drainage Basin","Basin + Capacity Constrained","On-Site List Lookup Column","Sheet Name","Infeasible Infiltration",null,"Empty List","Environmentally Critical Areas","Dispersion Infeasible","Infiltration Investigation No","Infiltration Investigation Yes","Infiltration Infeasible","ROW Surface List","Approved Point of Stormwater Discharge","Approved Point of Sub Discharge","Approved Point of Wastewater Discharge","Does Not Apply"]
["Trail and Sidewalk","Roof","-",6,"Vertical","Yes",null,"Not Evaluated","Listed Creek Basin","Listed Creek BasinYes",1,"Trail","Infeasible",null,{"$f":"\"\"","v":""},"No","Site cannot meet required horizontal setbacks ","Site is mapped as \"infltr. investigation not required\"","Simple infiltration test","Can’t meet setbacks from structures/property lines","ROW","Public Storm Drain Main ","Public Storm Drain Main ","Public Sanitary Sewer Main","Does Not Apply for Roadway or Trail and Sidewalk projects"]
["Parcel-Based","Non-Roof","Infeasible",12,"3H:1V","No","✓","Evaluation not required for roof.","Non-listed Creek Basin","Non-listed Creek BasinYes",1,"Parcel","Infiltration is infeasible on site.",null,null,"Geologic Hazard/ Steep Slope Area","Site constraints make dispersion infeasible","Other","Small PIT test","Can’t meet separation from groundwater/hard pan","Alley","Drainage Ditch","Drainage Ditch","Public Combined Sewer Main"]
["Roadway",null,"Use BMP",null,null,null,null,"Evaluation not required for other surfaces.","Designated Receiving Water","Designated Receiving WaterYes",2,"Road","Dispersion is infeasible",null,null,"Flood-prone Area","Site cannot meet flow path requirements ",null,"Large PIT test","Can’t meet setbacks from environmental “Site Constraints”","Arterial Street or Collector","Drainage Culvert","Drainage Culvert","Existing Septic System (King County Public Health Department Approval Required)"]
["Utility",null,"Not Evaluated",null,null,null,null,null,"Combined Sewer Service Area","Combined Sewer Service AreaYes",2,"x",null,null,null,"Wetland","One or more of the infeasibility criteria for “All Dispersion BMPs” (Appendix C, Table C.1) apply.",null,"Deep infiltration test","Measured infl rate is less than 0.3 inch/hour","Roadway","Curb Weep","Direct to Receiving Water"]
["Pavement Maintenance",null,"None Feasible",null,null,null,null,null,"Small Lake Basins","Small Lake BasinsYes",1,"x",null,null,null,"Fish and Wildlife Conservation Area",null,null,null,"Site is mapped as \"infltr. investigation not required\"","Other","Alley Surface Drain","Wetland"]
{"$rows_left_out":402}
{"sheet":"BMP Modeling","index":7,"n_rows":50,"n_cols":44,"rows_kept":50,"cut":false,"hidden":true,"merged":[[7,0,7,2],[39,1,39,2],[23,1,23,2],[19,3,19,7],[21,3,21,7],[23,3,23,7],[25,3,25,7],[15,15,15,21],[17,15,17,21],[19,15,19,21],[21,15,21,21],[23,15,23,21],[25,15,25,21],[27,15,27,21],[29,15,29,21],[31,15,31,21],[33,15,33,21],[35,15,35,21],[37,15,37,21],[39,15,39,21],[7,9,7,13],[9,9,9,13],[11,9,11,13],[13,9,13,13],[37,3,37,7],[27,9,27,13],[29,9,29,13],[31,9,31,13],[33,9,33,13],[35,9,35,13],[37,9,37,13],[29,1,29,2],[27,1,27,2],[31,1,31,2],[33,1,33,2],[35,3,35,7],[27,3,27,7],[29,3,29,7],[31,3,31,7],[29,31,29,35],[27,23,27,29],[15,3,15,7],[35,1,35,2],[35,37,35,41],[27,37,27,41],[15,9,15,13],[17,9,17,13],[19,9,19,13],[21,9,21,13],[23,9,23,13],[31,37,31,41],[33,37,33,41],[23,37,23,41],[25,1,25,2],[25,37,25,41],[17,37,17,41],[17,3,17,7],[45,3,45,7],[45,23,45,29],[39,9,39,13],[43,15,43,21],[45,15,45,21],[41,15,41,21],[47,31,47,35],[9,1,9,2],[9,37,9,41],[37,1,37,2],[25,9,25,13],[35,31,35,35],[33,31,33,35],[33,3,33,7],[29,37,29,41],[21,31,21,35],[19,1,19,2],[19,37,19,41],[21,1,21,2],[37,37,37,41],[37,31,37,35],[23,31,23,35],[25,31,25,35],[27,31,27,35],[45,37,45,41],[45,31,45,35],[47,1,47,2],[39,23,39,29],[41,23,41,29],[43,23,43,29],[39,31,39,35],[39,3,39,7],[41,9,41,13],[43,9,43,13],[45,9,45,13],[47,9,47,13],[39,37,39,41],[41,1,41,2],[41,37,41,41],[43,1,43,2],[43,37,43,41],[47,15,47,21],[47,37,47,41],[45,1,45,2],[43,31,43,35],[41,31,41,35],[41,3,41,7],[43,3,43,7],[0,0,0,71],[1,0,1,71],[13,31,13,35],[9,31,9,35],[11,31,11,35],[21,37,21,41],[11,1,11,2],[13,1,13,2],[13,37,13,41],[15,1,15,2],[15,37,15,41],[9,3,9,7],[11,3,11,7],[13,3,13,7],[4,1,6,69],[7,3,7,7],[11,43,11,70],[13,43,13,70],[15,43,15,70],[11,37,11,41],[17,1,17,2],[17,43,17,70],[19,43,19,70],[21,43,21,70],[23,43,23,70],[25,43,25,70],[9,43,9,70],[7,37,7,41],[7,31,7,35],[7,23,7,29],[11,23,11,29],[13,23,13,29],[15,23,15,29],[17,23,17,29],[19,23,19,29],[9,23,9,29],[21,23,21,29],[23,23,23,29],[25,23,25,29],[15,31,15,35],[17,31,17,35],[19,31,19,35],[7,15,7,21],[9,15,9,21],[11,15,11,21],[13,15,13,21],[49,1,50,70],[27,43,27,70],[29,43,29,70],[31,43,31,70],[33,43,33,70],[35,43,35,70],[37,43,37,70],[39,43,39,70],[41,43,41,70],[43,43,43,70],[29,23,29,29],[31,23,31,29],[33,23,33,29],[35,23,35,29],[37,23,37,29],[47,3,47,7],[47,23,47,29],[45,43,45,70],[47,43,47,70],[31,31,31,35]]}
["On-site Stormwater Management Calculator"]
["BMP Modeling Results"]
[{"$f":"Version","v":"Version 05-22-2026"}]
[]
[null,"For the On-Site Performance Standard the modeling approach for each BMP design shall be applied. Refer to Section 4.1.3 and Appendix F in the Seattle Stormwater Manual for modeling requirements and guidelines."]
[]
{"$rows_left_out":45}
{"sheet":"BMP Sizing","index":8,"n_rows":249,"n_cols":46,"rows_kept":249,"cut":false,"hidden":false,"merged":[[248,1,248,36],[98,1,98,12],[88,21,88,26],[94,13,94,20],[94,21,94,26],[92,13,92,20],[70,13,70,20],[88,13,88,20],[68,1,68,12],[70,7,70,11],[80,7,80,11],[90,7,90,11],[108,21,108,26],[98,13,98,20],[108,13,108,20],[104,13,104,20],[104,21,104,26],[246,21,246,26],[136,21,136,26],[146,21,146,26],[156,21,156,26],[166,21,166,26],[176,21,176,26],[186,21,186,26],[68,21,68,26],[58,13,58,20],[68,13,68,20],[72,13,72,20],[62,13,62,20],[78,13,78,20],[60,21,60,26],[70,21,70,26],[74,21,74,26],[72,21,72,26],[74,13,74,20],[66,21,66,26],[76,21,76,26],[48,28,48,36],[6,10,6,25],[128,1,128,12],[128,13,128,20],[128,21,128,26],[118,13,118,20],[120,13,120,20],[118,1,118,12],[108,1,108,12],[78,1,78,12],[80,13,80,20],[80,21,80,26],[82,21,82,26],[88,1,88,12],[78,21,78,26],[82,13,82,20],[112,21,112,26],[112,13,112,20],[98,21,98,26],[102,21,102,26],[100,21,100,26],[90,21,90,26],[92,21,92,26],[84,13,84,20],[58,28,58,36],[68,28,68,36],[42,26,42,37],[4,5,4,8],[6,5,6,8],[8,5,8,8],[10,5,10,8],[20,5,20,8],[50,13,50,20],[48,21,48,26],[48,13,48,20],[50,21,50,26],[6,26,6,37],[8,26,8,37],[10,26,10,37],[12,26,12,37],[14,26,14,37],[16,26,16,37],[18,10,18,25],[16,10,16,25],[14,10,14,25],[12,10,12,25],[10,10,10,25],[28,26,28,37],[48,1,48,12],[58,1,58,12],[54,13,54,20],[54,21,54,26],[64,13,64,20],[64,21,64,26],[52,21,52,26],[62,21,62,26],[60,13,60,20],[61,13,61,20],[52,13,52,20],[50,7,50,11],[60,7,60,11],[56,21,56,26],[58,21,58,26],[0,0,0,37],[1,0,1,37],[3,1,3,36],[45,5,45,7],[4,1,4,4],[6,1,6,4],[8,1,8,4],[10,1,10,4],[12,1,12,4],[14,1,14,4],[16,1,16,4],[18,1,18,4],[20,1,20,4],[22,1,22,4],[24,1,24,4],[22,5,22,8],[42,5,42,8],[42,10,42,25],[8,10,8,25],[22,10,22,25],[20,10,20,25],[18,5,18,8],[26,1,26,4],[26,5,26,8],[4,10,4,24],[36,1,36,4],[36,5,36,8],[36,10,36,25],[36,26,36,37],[38,1,38,4],[38,5,38,8],[24,5,24,8],[12,5,12,8],[14,5,14,8],[16,5,16,8],[18,26,18,37],[20,26,20,37],[22,26,22,37],[24,10,24,25],[28,10,28,25],[26,10,26,25],[26,26,26,37],[28,1,28,4],[28,5,28,8],[24,26,24,37],[50,28,50,36],[30,1,30,4],[30,5,30,8],[30,10,30,25],[30,26,30,37],[32,1,32,4],[32,5,32,8],[32,10,32,25],[32,26,32,37],[34,1,34,4],[34,5,34,8],[34,10,34,25],[34,26,34,37],[38,10,38,25],[38,26,38,37],[40,1,40,4],[40,5,40,8],[40,10,40,25],[40,26,40,37],[42,1,42,4],[44,5,44,8],[44,10,44,25],[44,26,44,37],[44,1,44,4],[150,13,150,20],[150,21,150,26],[150,28,150,36],[148,13,148,20],[148,21,148,26],[148,28,148,36],[142,21,142,26],[142,13,142,20],[144,13,144,20],[144,21,144,26],[140,13,140,20],[140,21,140,26],[138,13,138,20],[60,28,60,36],[70,28,70,36],[80,28,80,36],[90,28,90,36],[100,28,100,36],[110,28,110,36],[140,28,140,36],[128,28,128,36],[138,28,138,36],[120,28,120,36],[110,13,110,20],[134,21,134,26],[78,28,78,36],[88,28,88,36],[98,28,98,36],[108,28,108,36],[118,28,118,36],[84,21,84,26],[90,13,90,20],[130,21,130,26],[132,21,132,26],[100,13,100,20],[102,13,102,20],[118,21,118,26],[110,21,110,26],[86,21,86,26],[96,21,96,26],[106,21,106,26],[116,21,116,26],[126,21,126,26],[158,28,158,36],[160,13,160,20],[160,21,160,26],[160,28,160,36],[162,13,162,20],[162,21,162,26],[114,21,114,26],[124,13,124,20],[124,21,124,26],[134,13,134,20],[122,21,122,26],[122,13,122,20],[130,13,130,20],[152,13,152,20],[152,21,152,26],[154,13,154,20],[154,21,154,26],[158,13,158,20],[158,21,158,26],[138,21,138,26],[130,28,130,36],[120,21,120,26],[132,13,132,20],[114,13,114,20],[164,13,164,20],[164,21,164,26],[168,1,168,12],[168,13,168,20],[168,21,168,26],[168,28,168,36],[170,13,170,20],[170,21,170,26],[170,28,170,36],[172,13,172,20],[172,21,172,26],[174,13,174,20],[174,21,174,26],[178,1,178,12],[178,13,178,20],[178,21,178,26],[178,28,178,36],[180,13,180,20],[180,21,180,26],[180,28,180,36],[182,13,182,20],[182,21,182,26],[184,13,184,20],[184,21,184,26],[188,1,188,12],[188,13,188,20],[188,21,188,26],[188,28,188,36],[190,13,190,20],[190,21,190,26],[190,28,190,36],[190,7,190,11],[192,13,192,20],[192,21,192,26],[194,13,194,20],[194,21,194,26],[198,1,198,12],[198,13,198,20],[198,21,198,26],[198,28,198,36],[200,13,200,20],[200,21,200,26],[200,28,200,36],[200,7,200,11],[196,21,196,26],[202,13,202,20],[202,21,202,26],[204,13,204,20],[204,21,204,26],[208,1,208,12],[208,13,208,20],[208,21,208,26],[208,28,208,36],[210,13,210,20],[210,21,210,26],[210,28,210,36],[210,7,210,11],[206,21,206,26],[212,13,212,20],[212,21,212,26],[214,13,214,20],[214,21,214,26],[218,1,218,12],[218,13,218,20],[218,21,218,26],[218,28,218,36],[220,13,220,20],[220,21,220,26],[220,28,220,36],[220,7,220,11],[216,21,216,26],[238,28,238,36],[240,13,240,20],[240,21,240,26],[240,28,240,36],[222,13,222,20],[222,21,222,26],[224,13,224,20],[224,21,224,26],[228,1,228,12],[228,13,228,20],[228,21,228,26],[228,28,228,36],[230,13,230,20],[230,21,230,26],[230,28,230,36],[230,7,230,11],[226,21,226,26],[236,21,236,26],[242,13,242,20],[242,21,242,26],[244,13,244,20],[244,21,244,26],[232,13,232,20],[232,21,232,26],[234,13,234,20],[234,21,234,26],[238,1,238,12],[238,13,238,20],[238,21,238,26],[240,7,240,11],[100,7,100,11],[110,7,110,11],[120,7,120,11],[130,7,130,11],[140,7,140,11],[150,7,150,11],[160,7,160,11],[170,7,170,11],[180,7,180,11],[138,1,138,12],[158,1,158,12],[148,1,148,12]]}
["On-site Stormwater Management Calculator - List Approach"]
["BMP Sizing"]
[{"$f":"Version","v":"Version 05-22-2026"}]
[null,"\nMore than one surface can drain to the same BMP. For example, a garage roof and driveway may be managed by a single infiltration trench. Please indicate which surfaces are draining to which BMPs in the dropdown menus.\n\n"]
[null,"Surface",null,null,null,"Area (sf)",null,null,null,null,"Select BMP",null,null,null,null,null,null,null,null,null,null,null,null,null,null,null,null,null,null,null,null,null,null,null,null,null,null,null,null,"Dropdown List","Unique Count","BMP Type","Can there be more than one BMP","Match"]
[]
{"$rows_left_out":244}
{"sheet":"Infeasibility Criteria","index":9,"n_rows":356,"n_cols":3,"rows_kept":356,"cut":false,"hidden":false,"merged":[[0,0,0,3]]}
["On-site Stormwater Management Calculator"]
[null,null,"Infeasibility Criteria"]
[{"$f":"Version","v":"Version 05-22-2026"}]
[]
["Infeasibility Criteria"]
[null,"Full Dispersion"]
{"$rows_left_out":350}