{"text_format":"1","workbook":"xlsx","n_sheets":9,"sheets":["ReadMe","ENV-SUM","ENV-REQUIREMENTS","ENV-PRESCRIPTIVE","ENV-UA","Target Area Adjustments","TA1","ENV-SHGC","ENV-CHK"],"not_rendered":{"charts":0,"images":4,"macros":1,"external_links":0,"defined_names":109,"comments":1,"pivot_tables":0},"unopened":[],"bounds":{"document_bytes":16777216,"sheet_cells":100000,"rows_first":2000,"rows_last":500,"rows_between":2000,"halvings":0,"cell_chars":16384,"cell_head_chars":4096},"cells_cut":0,"cells_raw":0,"read":"whole","date_system":"1900"}

{"sheet":"ReadMe","index":0,"n_rows":42,"n_cols":2,"rows_kept":42,"cut":false,"hidden":false,"merged":[[1,0,1,1],[5,0,6,0],[9,0,10,0],[13,0,19,0],[41,0,41,1],[27,0,27,1],[29,0,30,0],[31,0,32,0],[35,0,38,0],[39,0,40,0]]}
["Instructions for Electronic Forms, pg 1"]
["2012 Seattle Energy Code Compliance Forms for Commercial Buildings including R2 & R3 over 3 stories and all R1 "]
[null,"Revised Apr 2015"]
[null,"     Commercial Provision Chapters 1 - 5 of the 2012 Seattle Energy Code apply to all commercial occupancies, R-2 and R-3 occupancies greater than 3 stories above grade, and R-1 occupancy (all building heights)."]
["Intro","     This file, 2012sec-ENV-v1.XLSM, has electronic compliance forms for envelope provisions as defined in Sections C101, C303, C402 and Appendix A for Climate Zones 4c and 5b. There are two companion files: 2012sec-LTG-v1.XLSM (Section C405 lighting, motor, and transformer requirements), and 2012sec-MECH-v1.XLSM (Section C403 mechanical systems requirements). "]
["Energy Code ","    This form is a compliance aid and is not a substitute for the full energy code text or specific jurisdiction compliance requirements. Users should refer to the code text and contact the DPD for complete information. The full 2012 Seattle Energy Code text is available for download from the Seattle DPD website:"]
[null,"http://www.seattle.gov/DPD/codesrules/codes/energy/overview/"]
["Training ","There are no explicity training materials for these forms.  Refer to the NEEC website (www.neec.net) for instruction on how to complete the 2012 WSEC Compliance Forms which are very similar."]
["Start-up","Select this file from the DPD website to download to your computer.  When opening the file be sure to Enable Macros. "]
["Overview ","     This file is an Excel workbook that contains multiple compliance forms and resources in Excel worksheets. Each worksheet is indicated by a tab at the bottom of the screen. You may visit each worksheet by selecting it's tab.  "]
[null,"     Most calculations are automated. Cells that display informational text and the results of calculations are write-protected and cannot be edited. "]
["Save Files ","This file is saved in the same manner as any standard Excel file.   "]
["Getting Around","     Some forms have two pages. Both pages are available on screen when you select the tab for a form (worksheet). Use the scroll bars to find the second page located below the first page."]
["Input Cells ","     All general project information and the date are entered once on ENV-SUM. This information is automatically replicated on all other ENV forms. The ENV-SUM form accompanies all other ENV forms."]
[null,"     Only input cells are accessible. If you try to edit a write-protected cell an error message will appear requesting a password.  A password IS NOT required to complete these forms. You may use the TAB key to move to the next input cell. If the TAB doesn't take you where you want to go, use your mouse to move around the form. "]
[null,"     Avoid excessively long text strings when entering information. In some cases, text that extends beyond the available space will not be visible. In most cases the text will wrap within the cell. This may force part of the form onto a new page."]
[null,"     To enter the date, use this format: mm/dd/yyyy.  For example, you would enter 7/1/2013 or 12/21/2014."]
[null,"     Check boxes can be checked or unchecked by clicking in the box with your mouse. Radio buttons (circles) allow only one in a set to be selected."]
[null,"     Drop-down lists have an arrow at the right side of the cell. Click on the arrow with your mouse and select the appropriate option. Use the delete button on your computer to clear a drop-down entry."]
[null,"     When a form has a space for notes or explanation, click anywhere in the space to edit. "]
{"$rows_left_out":23}
{"sheet":"ENV-SUM","index":1,"n_rows":42,"n_cols":8,"rows_kept":42,"cut":false,"hidden":false,"merged":[[15,0,15,3],[15,4,15,5],[35,0,36,1],[35,2,36,6],[24,3,24,6],[25,3,25,6],[24,0,25,1],[27,0,27,1],[33,0,33,1],[29,0,30,1]]}
["Envelope Summary",null,null,null,{"$f":"'TA1'!$C$118","v":" "},null,"ENV-SUM"]
[{"$f":"ReadMe!A2","v":"2012 Seattle Energy Code Compliance Forms for Commercial Buildings including R2 & R3 over 3 stories and all R1 "},null,null,null,null,null,{"$f":"ReadMe!B3","v":"Revised Apr 2015"}]
["Project Info","Project Address","1 - This address line will copy onto other forms",null,null,"Date","2014-01-01"]
[null,null,null,null,null,"For DPD Use"]
[]
[null,"Applicant Name:"]
[null,"Applicant Address:"]
[null,"Applicant Phone:"]
[]
["Project Description"]
[]
["Compliance Path"]
[]
["Occupancy Group"]
[]
["Maximum Prescriptive Vertical Fenestration (%)",null,null,null,{"$f":"IF(AND(ComponentPath<4,OccGroup<3),IF(SLR>1,IF(VertFenAlt=1,\"40% per C402.3.1.3\",IF(VertFenAlt=2,\"40% per C402.3.1.1\",\"30% per C402.3.1\")),IF(VertFenAlt=1,\"40% per C402.3.1.3 adjusted for SLR transfer\",IF(VertFenAlt=2,\"40% per C402.3.1.1 adjusted for SLR transfer\",\"30% per C402.3.1 adjusted for SLR transfer\"))),\"Set Compliance Path and Occupancy Group\")","v":"Set Compliance Path and Occupancy Group"},null,{"$f":"IF(AND(ComponentPath<4,OccGroup<3),IF(SLR>1,IF(VertFenAlt=3,0.3,0.4),TargetMaxVF),\"\")","v":""}]
[]
[null,null,"Total Vertical Fenestration\n(rough opening)","divided by","Gross Exterior Above Grade\nWall Area","\ntimes 100 equals","\n% Vertical Fenestration"]
[null,null,null,"¸",null,"X 100 =",{"$f":"IF(C19=\"Path?\",\"Path?\",IF(E19>0,C19/E19,\"\"))","v":""}]
[null,null,"Total Skylight","divided by","Gross Exterior Roof Area","\ntimes 100 equals","\n% Skylight"]
{"$rows_left_out":23}
{"sheet":"ENV-REQUIREMENTS","index":2,"n_rows":72,"n_cols":6,"rows_kept":72,"cut":false,"hidden":false,"merged":[[12,2,12,3],[54,0,54,1],[59,0,59,1],[71,0,71,5],[37,2,37,3],[37,4,37,5],[39,0,39,1],[39,2,39,3],[39,4,39,5],[47,2,47,3],[48,2,48,3],[49,2,49,3],[50,2,50,3],[41,4,45,5],[45,2,45,3],[46,0,46,5],[47,4,51,5],[51,2,51,3],[41,2,41,3],[42,2,42,3],[43,2,43,3],[44,2,44,3],[40,0,40,5],[36,2,36,5],[38,0,38,1],[38,2,38,3],[38,4,38,5],[28,0,28,1],[28,2,28,5],[29,2,29,5],[34,0,34,1],[36,0,36,1],[27,0,27,1],[16,0,16,1],[16,2,16,3],[17,0,17,1],[21,0,21,1],[22,2,22,3],[23,2,23,3],[24,0,24,1],[24,2,24,5],[25,2,25,3],[27,2,27,3],[27,4,27,5],[26,2,26,3],[11,0,11,1],[4,2,4,3],[4,4,4,5],[6,0,6,1],[6,2,6,5],[7,0,7,1]]}
["Envelope Requirements Summary, pg 1",null,null,null,{"$f":"'TA1'!$C$118","v":" "},"ENV-REQ"]
[{"$f":"ReadMe!A2","v":"2012 Seattle Energy Code Compliance Forms for Commercial Buildings including R2 & R3 over 3 stories and all R1 "},null,null,null,null,{"$f":"ReadMe!B3","v":"Revised Apr 2015"}]
["Minimum Requirements"]
["for Prescriptive Compliance"]
[null,"Prescriptive Path"," Table C402.2 Notes 1,7\nInsulation Minimum R-Value",null,"Table C402.1.2 Notes 1,2\nAssembly Maximum U-factor"]
[null,"Occupancy Group  ","All Other","Group R","All Other","Group R"]
["Opaque Elements"]
["Roofs"]
[null,"Insulation Entirely above Deck","R-38 c.i.","R-38 c.i.","U-0.026","U-0.026"]
[null,"Metal Building (with R-3.5 thermal blocks) Note 3","R-25 + R-22 Ls","R-25 + R-22 Ls","U-0.027","U-0.027"]
[null,"Attic and Other","R-49","R-49","U-0.021","U-0.021"]
["Walls, Above-grade"]
[null,"Mass","Ext: R-16 c.i. (ext)\nInt: R-13+R6 c.i. (wd)\nInt: R-13+R10 c.i. (mtl)",null,"U-0.057","U-0.057"]
[null,"Metal Building","R-13 + R-13 c.i.","R-13 + R-13 c.i.","U-0.052","U-0.052"]
[null,"Steel Framed","R-13 + R-10c.i.","R-19 + R-8.5 c.i.","U-0.055","U-0.055"]
[null,"Wood Framed and Other","R13 + R7.5 c.i.","R-21 int","U-0.051","U-0.051"]
["Below Grade Wall Note 4",null,"Ext: R-10 c.i. (ext)\nInt: R-19 (wd)\nInt: R-13+R6 c.i. (mtl)",null,"U-0.070","U-0.070"]
["Floors"]
[null,"Mass","R-30 c.i.","R-30 c.i.","U-0.029","U-0.029"]
[null,"Steel Joist","R-38 + R-4 c.i.","R-38 + R-4 c.i.","U-0.029","U-0.029"]
{"$rows_left_out":53}
{"sheet":"ENV-PRESCRIPTIVE","index":3,"n_rows":111,"n_cols":13,"rows_kept":111,"cut":false,"hidden":false,"merged":[[110,4,110,6],[111,4,111,6],[107,0,107,2],[108,0,108,2],[107,7,107,8],[108,7,108,8],[110,0,110,2],[109,0,109,2],[110,7,110,8],[111,7,111,8],[102,0,102,2],[103,0,103,2],[104,0,104,2],[105,0,105,2],[106,0,106,2],[102,7,102,8],[103,7,103,8],[104,7,104,8],[105,7,105,8],[106,7,106,8],[55,4,55,6],[55,7,55,8],[8,7,8,8],[109,7,109,8],[71,7,71,8],[101,0,101,4],[71,4,71,6],[102,4,102,6],[103,4,103,6],[104,4,104,6],[105,4,105,6],[106,4,106,6],[107,4,107,6],[108,4,108,6],[109,4,109,6],[8,4,8,6]]}
["Prescriptive Path, pg. 1",null,null,null,null,{"$f":"'TA1'!$C$118","v":" "},null,null,"ENV-PRESCRIPTIVE"]
[{"$f":"'ENV-SUM'!A2","v":"2012 Seattle Energy Code Compliance Forms for Commercial Buildings including R2 & R3 over 3 stories and all R1 "},null,null,null,null,null,null,null,{"$f":"'ENV-SUM'!G2","v":"Revised Apr 2015"}]
[{"$f":"'ENV-SUM'!B3","v":"Project Address"},null,null,null,{"$f":"IF('ENV-SUM'!$C$3=\"1 - This address line will copy onto other forms\",\"1 - Fill this line out on ENV-SUM\",'ENV-SUM'!$C$3)","v":"1 - Fill this line out on ENV-SUM"},null,null,"Date",{"$f":"TEXT('ENV-SUM'!$G$3,\"mm/dd/yyyy\")","v":"01/01/2014"}]
["Occupancy Group",null,null,null,null,null,null,"For Building Department Use"]
["Fenestration Area as % gross above-grade wall area",null,null,null,{"$f":"IF('ENV-SUM'!G19>0,'ENV-SUM'!G19,0)","v":""},"Max. Target:",{"$f":"'TA1'!J27","v":""}]
["Skylight Area as % gross roof area",null,null,null,{"$f":"IF('ENV-SUM'!G21>0,'ENV-SUM'!G21,0)","v":""},"Max. Target:",{"$f":"'TA1'!D80","v":0}]
["Vertical Fenestration Alternates:",null,null,null,{"$f":"'TA1'!B111","v":"None Selected on ENV-SUM"}]
[]
["Building Component ",null,null,null,"R-Value for Prescriptive Compliance",null,null,"U-Factor/F-Factor for Alternative Prescriptive Compliance"]
[null,null,null,"Provide page/plan # of assembly detail and ID.","Cavity Ins.\nR-Value","Continuous Ins. (CI)\nR-Value","Alternate CI\nR-Value\n(Table C402.2 Footnote F)1","Assembly \nU-Factor","U-Factor Source\n(Appendix A, Chapter 3 table, or approved calculation method) "]
[null,null,"ID:"]
[null,null,"ID:"]
[null,null,"ID:",null,null,null,null,null,null,null,null,null,0]
[null,null,"ID:"]
[null,null,"ID:"]
[null,null,"ID:"]
[null,null,"ID:"]
[null,null,"ID:"]
[null,null,"ID:"]
[null,null,"ID:"]
{"$rows_left_out":92}
{"sheet":"ENV-UA","index":4,"n_rows":98,"n_cols":13,"rows_kept":98,"cut":false,"hidden":false,"merged":[]}
["Component Performance Path, pg. 1",null,null,null,null,null,null,null,null,{"$f":"'TA1'!$C$118","v":" "},null,"ENV-UA"]
[{"$f":"'ENV-SUM'!A2","v":"2012 Seattle Energy Code Compliance Forms for Commercial Buildings including R2 & R3 over 3 stories and all R1 "},null,null,null,null,null,null,null,null,null,null,{"$f":"'ENV-SUM'!G2","v":"Revised Apr 2015"}]
[{"$f":"'ENV-SUM'!B3","v":"Project Address"},null,null,null,null,{"$f":"IF('ENV-SUM'!$C$3=\"1 - This address line will copy onto other forms\",\"1 - Fill this line out on ENV-SUM\",'ENV-SUM'!$C$3)","v":"1 - Fill this line out on ENV-SUM"},null,null,null,"Date",{"$f":"TEXT('ENV-SUM'!$G$3,\"mm/dd/yyyy\")","v":"01/01/2014"}]
["Occupancy Group",null,null,null,null,null,null,null,null,"For Building Department Use"]
["Change in occupancy or space conditioning"]
["Fenestration Area as % gross above-grade wall area",null,null,null,null,null,{"$f":"IF('ENV-SUM'!G19>0,'ENV-SUM'!G19,0)","v":""},"Max. Target:",{"$f":"'TA1'!J27","v":""}]
["Skylight Area as % gross roof area",null,null,null,null,null,{"$f":"IF('ENV-SUM'!G21>0,'ENV-SUM'!G21,0)","v":""},"Max. Target:",{"$f":"'TA1'!D80","v":0}]
["Vertical  Fenestration Alternates:",null,null,null,null,null,{"$f":"'TA1'!B111","v":"None Selected on ENV-SUM"}]
[]
["Building Component ",null,null,null,null,null,null,"Proposed UA",null,"Target UA"]
[null,"Provide source of U-factor, page/plan # of assembly detail & ID",null,null,null,null,"U-factor","x Area (A)","= UA (U x A)","U-factor","x Area (A) =","UA (U x A)"]
[null,null,"R=",null,"ID:",null,null,null,{"$f":"IF(AND(G12=0,H12=0),0,IF(OR(G12=0,H12=0),NA(), H12*G12))","v":0},{"$f":"'TA1'!U108","v":"set occ."},{"$f":"'TA1'!J97","v":0},{"$f":"IF(TYPE(J12*K12)<>1,0,J12*K12)","v":0}]
[null,null,"R=",null,"ID:",null,null,null,0,"Above Deck Insulation",null,{"$f":"'TA1'!U140","v":"set occ."}]
[null,null,"R=",null,"ID:",null,null,null,0,null,null,null,0]
[null,null,"R=",null,"ID:",null,null,null,0,{"$f":"'TA1'!U109","v":"set occ."},{"$f":"'TA1'!J98","v":0},{"$f":"IF(TYPE(J15*K15)<>1,0,J15*K15)","v":0}]
[null,null,"R=",null,"ID:",null,null,null,0,"Metal Building",null,{"$f":"'TA1'!U141","v":"set occ."}]
[null,null,"R=",null,"ID:",null,null,null,0]
[null,null,"R=",null,"ID:",null,null,null,0,{"$f":"'TA1'!U110","v":"set occ."},{"$f":"'TA1'!J99","v":0},{"$f":"IF(TYPE(J18*K18)<>1,0,J18*K18)","v":0}]
[null,null,"R=",null,"ID:",null,null,null,0,"Single raft, attic, other",null,{"$f":"'TA1'!U142","v":"set occ."}]
[null,null,"R=",null,"ID:",null,null,null,0]
{"$rows_left_out":79}
{"sheet":"Target Area Adjustments","index":5,"n_rows":49,"n_cols":1,"rows_kept":49,"cut":false,"hidden":false,"merged":[]}
["Vertical Fenestration Target Area Adjustment Calculations  "]
[]
[]
[]
[]
[]
[]
[]
[]
[]
[]
[]
[]
[]
[]
[]
[]
[]
[]
[]
{"$rows_left_out":30}
{"sheet":"TA1","index":6,"n_rows":158,"n_cols":55,"rows_kept":158,"cut":false,"hidden":true,"merged":[[81,9,82,9],[24,7,25,7],[33,1,35,1]]}
[]
[]
[null,"Vertical Fenestration Target Area Calculations"]
[]
[]
[]
[null,null,"VF   = Vertical fenestration (exclude SLG)",null,null,null,"AG Wall = Above-grade wall (exclude SLW)"]
[null,null,"SG   = Exempt Single Glazing",null,null,null,"Gross Exterior Above-Grade Wall Area= VF + NW + DR"]
[null,null,"NW  = Net above grade wall (excluding VF, SG & DR)",null,null,null,"DR = Opaque doors"]
[null,null,"SLW = Street level gross wall below ceiling ",null,null,null,"SLG = Area of window in Street level qualified wall "]
[null,null,null,"  height and 20' per C402.3.1",null,null,"SLT = Window area transferred to Street Level Retail wall from other areas"]
[]
[null,"Proposed Areas"]
[]
[null,null,null,"Vertical Fenestration (non-exempt) ->","VF=",{"$f":"IF(ComponentPath=1,EnvSumTotWin-EnvSumExmptSngl,SUM('ENV-UA'!H72:H87))","v":0}]
[null,null,null,"Vertical Fenestration (exempt) ->","SG=",{"$f":"EnvSumExmptSngl","v":0}]
[null,null,null,"Opaque ->","NW=",{"$f":"IF(ComponentPath=1,EnvSumGrossWall-EnvSumTotWin,SUM('ENV-UA'!H21:H32))","v":0},"DR=",{"$f":"IF(ComponentPath=1,0,SUM('ENV-UA'!H65:H71))","v":0}]
[null,null,null,"Street Level Retail ->","SLT=",{"$f":"SLRtransfer","v":"n/a"}]
[]
[null,"Maximum Target Vertical Fenestration Calculation"]
{"$rows_left_out":139}
{"sheet":"ENV-SHGC","index":7,"n_rows":51,"n_cols":14,"rows_kept":51,"cut":false,"hidden":false,"merged":[[19,6,20,6],[35,6,36,6],[10,1,10,3],[11,1,11,3],[12,1,12,3],[13,1,13,3],[14,1,14,3]]}
["SHGC Calculation",null,null,null,null,null,{"$f":"'TA1'!$C$118","v":" "},null,null,"ENV-SHGC"]
[{"$f":"'ENV-SUM'!A2","v":"2012 Seattle Energy Code Compliance Forms for Commercial Buildings including R2 & R3 over 3 stories and all R1 "},null,null,null,null,null,null,null,null,{"$f":"'ENV-SUM'!G2","v":"Revised Apr 2015"}]
[{"$f":"'ENV-SUM'!B3","v":"Project Address"},null,{"$f":"IF('ENV-SUM'!$C$3=\"1 - This address line will copy onto other forms\",\"1 - Fill this line out on ENV-SUM\",'ENV-SUM'!$C$3)","v":"1 - Fill this line out on ENV-SUM"},null,null,null,null,"Date",{"$f":"TEXT('ENV-SUM'!$G$3,\"mm/dd/yyyy\")","v":"01/01/2014"}]
["Fenestration Area as % gross above-grade wall area",null,null,null,{"$f":"IF('ENV-SUM'!G19>0,'ENV-SUM'!G19,0)","v":""},null,{"$f":"'TA1'!J27","v":""},"For DPD Use"]
["Skylight Area as % gross roof area",null,null,null,{"$f":"IF('ENV-SUM'!G21>0,'ENV-SUM'!G21,0)","v":""},null,{"$f":"'TA1'!D80","v":0}]
["Vertical  Fenestration Alternates:",null,{"$f":"'TA1'!B111","v":"None Selected on ENV-SUM"}]
[]
[]
["  Skylights",null,null,null,null,"Proposed SHGC",null,"Target SHGC"]
["Provide source of SHGC, page/plan # of assembly detail & ID",null,null,null,"SHGC","x Area (A)","= SHGC x A","SHGC","x Area (A) =","SHGC x A"]
["  ID:",null,null,null,null,null,{"$f":"IF(AND(F11=0,E11=0),0,IF(OR(F11=0,E11=0),NA(),F11*E11))","v":0},{"$f":"'TA1'!AL104","v":"set occ."},{"$f":"'TA1'!J95","v":0},{"$f":"IF(TYPE(H11*I11)<>1,0,H11*I11)","v":0}]
["  ID:",null,null,null,null,null,{"$f":"IF(AND(F12=0,E12=0),0,IF(OR(F12=0,E12=0),NA(),F12*E12))","v":0},"SHGC",null,{"$f":"'TA1'!AL133","v":"set occ."}]
["  ID:",null,null,null,null,null,{"$f":"IF(AND(F13=0,E13=0),0,IF(OR(F13=0,E13=0),NA(),F13*E13))","v":0}]
["  ID:",null,null,null,null,null,{"$f":"IF(AND(F14=0,E14=0),0,IF(OR(F14=0,E14=0),NA(),F14*E14))","v":0}]
["  ID:",null,null,null,null,null,{"$f":"IF(AND(F15=0,E15=0),0,IF(OR(F15=0,E15=0),NA(),F15*E15))","v":0},null,null,null,null,null,0]
[null,null,null,null,"Totals",{"$f":"SUM(F10:F15)","v":0},{"$f":"SUM(G10:G15)","v":0},"Totals",{"$f":"SUM(I10:I15)","v":0},{"$f":"SUM(J10:J15)","v":0}]
[]
[null,null,null,null,null,null,null,null,null,{"$f":"IF(ABS(F16-'TA1'!F73)>0.1,IF(F16>'TA1'!F73,CONCATENATE(\"More proposed skylight area here than ENV-UA - Remove  \",TEXT('TA1'!F73-F16,\"0.0\")),CONCATENATE(\"Less proposed skylight area here than ENV-UA - Add  \",TEXT('TA1'!F73-F16,\"0.0\" )) ),\" \")","v":" "}]
[]
[" All Non-North Vertical Fenestration+",null,null,null,"Proposed SHGC",null,"PF Category","Target SHGC ++"]
{"$rows_left_out":32}
{"sheet":"ENV-CHK","index":8,"n_rows":127,"n_cols":6,"rows_kept":127,"cut":false,"hidden":false,"merged":[[3,0,3,5],[86,0,86,5],[14,0,15,0],[14,1,15,1],[14,2,15,2],[14,4,15,4],[16,0,20,0],[16,1,20,1],[16,2,20,2],[16,4,20,4],[16,5,20,5],[22,0,27,0],[22,1,27,1],[22,2,27,2],[22,4,27,4],[22,5,27,5],[28,0,30,0],[28,1,30,1],[28,2,30,2],[28,4,30,4],[28,5,30,5],[32,0,34,0],[32,1,34,1],[32,2,34,2],[32,4,34,4],[32,5,34,5],[35,0,37,0],[35,1,37,1],[35,2,37,2],[35,4,37,4],[35,5,37,5],[38,5,40,5],[38,4,40,4],[38,2,40,2],[38,1,40,1],[38,0,40,0],[58,0,61,0],[58,1,61,1],[58,2,61,2],[58,4,61,4],[58,5,61,5],[49,0,51,0],[49,1,51,1],[49,2,51,2],[49,4,51,4],[49,5,51,5],[52,5,54,5],[52,4,54,4],[52,2,54,2],[52,1,54,1],[52,0,54,0],[55,0,56,0],[55,1,56,1],[55,2,56,2],[55,4,56,4],[55,5,56,5],[63,0,64,0],[63,1,64,1],[63,2,64,2],[63,4,64,4],[63,5,64,5],[65,5,67,5],[65,4,67,4],[65,2,67,2],[65,1,67,1],[65,0,67,0],[68,0,69,0],[68,1,69,1],[68,2,69,2],[68,4,69,4],[68,5,69,5],[14,5,15,5],[75,5,76,5],[75,4,76,4],[75,0,76,0],[75,1,76,1],[75,2,76,2],[73,0,74,0],[73,1,74,1],[73,2,74,2],[73,4,74,4],[73,5,74,5],[70,5,71,5],[70,4,71,4],[70,2,71,2],[70,1,71,1],[70,0,71,0]]}
["Building Permit Plans Checklist, pg. 1",null,null,null,null,"ENV-CHK"]
[{"$f":"ReadMe!A2","v":"2012 Seattle Energy Code Compliance Forms for Commercial Buildings including R2 & R3 over 3 stories and all R1 "},null,null,null,null,{"$f":"ReadMe!B3","v":"Revised Apr 2015"}]
["Project Address",null,{"$f":"IF('ENV-SUM'!$C$3=\"1 - This address line will copy onto other forms\",\"1 - Fill this line out on ENV-SUM\",'ENV-SUM'!$C$3)","v":"1 - Fill this line out on ENV-SUM"},null,"Date",{"$f":"'ENV-SUM'!G3","v":"2014-01-01"}]
["The following information is necessary to check a building permit application for compliance with the building envelope requirements in the \nSeattle Energy Code, Commercial Provisions."]
["Applicability (yes,no,na) ","Code Section","Component","Compliance information required in permit documents","Location in Documents","DPD Notes"]
["SCOPE "]
[null,"C101.5.2","Low energy spaces","Low energy spaces identified on plans"]
[null,"C101.5.2.1\nC402.1.4","Semi-heated spaces","Semi-heated spaces identified on plans"]
[null,"C402.5 C402.6","Cooler and freezer spaces","Walk-in and refrigerated warehouse cooler and freezer spaces identified on plans"]
[null,"C101.4.6","Mixed occupancy","Spaces with different occupancy requirements identified on plans"]
[null,"C101.4.4 C101.4.5","Change of occupancy/space conditioning","Existing F, S and U-occupancy building spaces undergoing a change of occupancy, space conditioning, or conversion to a residential dwelling unit from another occupancy that require compliance are identified on plans"]
["ENVELOPE PROVISIONS"]
[null,"C303.1","Insulation identification","Indicate identification mark shall be applied to all insulation materials"]
[null,"C303.1.3 C402.4.3","Fenestration product rating","Fenestration products shall be labeled with rated U-factor, SHGC, VT, and  leakage rating"]
[null,"C303.1.1 C402.2 ","General insulation installation","Indicate installation methods, thicknesses, densities and clearances to achieve the intended R-value of all insulation materials; "]
[null,null,null,"Where two or more layers of rigid insulation will be used, indicate that edge joints between layers are staggered"]
[null,"C402.2.1","Roof assembly insulation","Indicate R-value(s) of cavity/continuous insulation on roof sections;  "]
[null,null,null,"Indicate framing materials on roof sections; "]
[null,null,null,"Indicate method of framing for ceilings below vented attics and vaulted ceilings per A102.2 (std, adv);"]
[null,null,null,"Provide area-weighted calculations for sloped insulation installed entirely above deck;"]
{"$rows_left_out":107}