{"text_format":"1","workbook":"xlsx","n_sheets":10,"sheets":["ReadMe","PROJ-SUM","ENV-SUM","ENV-REQUIREMENTS","ENV-PRESCRIPTIVE","ENV-UA","TA1","Target Area Adjustments","ENV-SHGC","ENV-CHK"],"not_rendered":{"charts":0,"images":1,"macros":1,"external_links":0,"defined_names":130,"comments":1,"pivot_tables":0},"unopened":[],"bounds":{"document_bytes":16777216,"sheet_cells":100000,"rows_first":2000,"rows_last":500,"rows_between":2000,"halvings":0,"cell_chars":16384,"cell_head_chars":4096},"cells_cut":0,"cells_raw":0,"read":"whole","date_system":"1900"}

{"sheet":"ReadMe","index":0,"n_rows":44,"n_cols":2,"rows_kept":44,"cut":false,"hidden":false,"merged":[[1,0,1,1],[5,0,6,0],[9,0,10,0],[13,0,19,0],[43,0,43,1],[27,0,27,1],[29,0,30,0],[31,0,32,0],[37,0,40,0],[41,0,42,0],[34,0,35,0]]}
["Instructions for Electronic Forms, pg 1"]
["2015 Seattle Energy Code Compliance Forms for Commercial Buildings including R2, R3, & R4 over 3 stories and all R1 "]
[null,"Revised Aug 2019"]
[null,"     Commercial Provision Chapters 1 - 6 of the 2015 Seattle Energy Code apply to all commercial occupancies, R-2, R-3 & R4 occupancies greater than 3 stories above grade, and R-1 occupancy (all building heights)."]
["Intro","     This file, ENVSEC15-v4.XLSM, has electronic compliance forms for general project information including Section C406, and envelope provisions as defined in Sections C101, C303, C402, C406, Chapter 5 (existing buildings) and Appendix A (default values) for Climate Zones 4c. "]
["Energy Code ","    This form is a compliance aid and is not a substitute for the full energy code text or specific jurisdiction compliance requirements. Users should refer to the code text and contact the Seattle SDCI for complete information. The full 2015 Seattle Energy Code text is available for download from the SDCI website:"]
[null,"http://www.seattle.gov/sdci/codes/codes-we-enforce-(a-z)/energy-code"]
["Training ","There are no explicit training materials for these forms. Refer to the NEEC website for instruction on how to complete all of the 2015 WSEC Compliance Forms which are very similar."]
["Start-up","Select this file from the Seattle SDCI website to download to your computer.  When opening the file be sure to Enable Macros and if applicable Enable Content. "]
["Overview ","     This file is an Excel workbook that contains multiple compliance forms and resources in Excel worksheets. Each worksheet is indicated by a tab at the bottom of the screen. You may visit each worksheet by selecting it's tab. If you cannot see these tabs, select \"Full Screen\" in Excel."]
[null,"     Most calculations are automated. Cells that display informational text and the results of calculations are write-protected and cannot be edited. "]
["Save Files ","This file is saved in the same manner as any standard Excel file.   "]
["Getting Around","     Some forms have two or more pages. Both pages are available on screen when you select the tab for a form (worksheet). Use the scroll bars to find the second page located below the first page."]
["Input Cells ","     All general project information and the date are entered once on PROJ-SUM. This information is automatically replicated on all other ENV forms. The PROJ-SUM form accompanies all other ENV forms."]
[null,"     Only input cells are accessible. If you try to edit a write-protected cell an error message will appear requesting a password.  A password IS NOT required to complete these forms. You may use the TAB key to move to the next input cell. If the TAB doesn't take you where you want to go, use your mouse to move around the form. "]
[null,"     Avoid excessively long text strings when entering information. In some cases, text that extends beyond the available space will not be visible. In most cases the text will wrap within the cell. This may force part of the form onto a new page."]
[null,"     To enter the date, use this format: mm/dd/yyyy.  For example, you would enter 7/1/2018 or 12/21/2018."]
[null,"     Check boxes can be checked or unchecked by clicking in the box with your mouse. Radio buttons (circles) allow only one in a set to be selected."]
[null,"     Drop-down lists have an arrow at the right side of the cell. Click on the arrow with your mouse and select the appropriate option. Use the delete button on your computer to clear a drop-down entry."]
[null,"     When a form has a space for notes or explanation, click anywhere in the space to edit. "]
{"$rows_left_out":25}
{"sheet":"PROJ-SUM","index":1,"n_rows":42,"n_cols":9,"rows_kept":42,"cut":false,"hidden":false,"merged":[[17,4,17,5],[16,4,16,5],[19,0,19,1],[13,0,14,1],[16,0,17,1],[29,1,29,2],[31,0,40,1],[42,0,42,1],[2,1,2,2],[3,1,3,2],[4,1,4,2],[5,1,5,2],[6,1,6,2]]}
["Project Summary",null,null,null,null,"PROJ-SUM"]
[{"$f":"ReadMe!A2","v":"2015 Seattle Energy Code Compliance Forms for Commercial Buildings including R2, R3, & R4 over 3 stories and all R1 "},null,null,null,null,{"$f":"ReadMe!B3","v":"Revised Aug 2019"}]
["General Info","Project Title:",null,"1 - This title will copy onto other forms","Date","2019-01-01"]
[null,"Project Street Address:",null,null,"For SDCI Use"]
[null,"Project City, County, Zip:"]
[null,"Project Owner or Rep:"]
[null,"Jurisdiction:"]
[]
[]
["Project Description",null,null,null,null,null,null,null,4]
[]
["Occupancy Type",null,null,null,null,null,null,null,4]
[]
[]
[]
[]
["Floor Area and Stories",null,"Floors Above Grade","Building Gross Conditioned Floor Area","Project Gross Conditioned Floor Area"]
[]
[]
["General Compliance Path",null,null,null,null,null,null,null,"linked"]
{"$rows_left_out":23}
{"sheet":"ENV-SUM","index":2,"n_rows":71,"n_cols":13,"rows_kept":71,"cut":false,"hidden":false,"merged":[[34,3,34,6],[7,2,7,4],[57,0,57,1],[59,2,59,3],[34,0,34,1],[35,0,35,1],[50,0,50,1],[35,3,35,6],[37,0,37,1],[39,2,39,6],[40,2,40,3],[43,0,44,1],[41,2,41,3],[36,0,36,3],[36,4,36,6],[2,2,2,4],[19,0,19,1],[26,0,26,1],[12,0,12,1],[13,0,13,1],[4,2,4,4],[5,2,5,4],[6,2,6,4],[8,2,8,4]]}
["Envelope Summary",null,null,null,null,null,"ENV-SUM"]
[{"$f":"ReadMe!A2","v":"2015 Seattle Energy Code Compliance Forms for Commercial Buildings including R2, R3, & R4 over 3 stories and all R1 "},null,null,null,null,null,{"$f":"ReadMe!B3","v":"Revised Aug 2019"}]
["Project Info","Project Title:",{"$f":"IF('PROJ-SUM'!$D$3=\"1 - This title will copy onto other forms\",\"1 - Fill this line out on PROJ-SUM\",'PROJ-SUM'!$D$3)","v":"1 - Fill this line out on PROJ-SUM"},null,null,"Date",{"$f":"TEXT('PROJ-SUM'!$F$3,\"mm/dd/yyyy\")","v":"01/01/2019"}]
[null,null,null,null,null,"For SDCI Use"]
[null,"Company Name:"]
[null,"Company Address:"]
[null,"Applicant Name:"]
[null,"Applicant Phone:"]
[null,"Applicant Email:"]
[]
["Project Description"]
["Envelope Project Scope"]
["Envelope Description"]
["Air Barrier Testing"]
[]
["Compliance Documentation Scope and Method"]
["Scope of This Calculation "]
["Target Insulation Allowance"]
["Envelope Compliance Path"]
["Component Performance Calculation Adjustments"]
{"$rows_left_out":52}
{"sheet":"ENV-REQUIREMENTS","index":3,"n_rows":99,"n_cols":6,"rows_kept":99,"cut":false,"hidden":false,"merged":[[35,4,35,5],[36,4,36,5],[37,4,37,5],[38,4,38,5],[15,2,15,3],[26,2,26,5],[27,2,27,3],[30,2,30,3],[31,4,31,5],[30,4,30,5],[29,2,29,5],[33,4,33,5],[34,4,34,5],[13,2,13,3],[29,0,29,1],[54,4,54,5],[48,4,48,5],[50,4,50,5],[51,4,51,5],[52,4,52,5],[53,4,53,5],[30,0,30,1],[18,0,18,1],[18,2,18,3],[19,0,19,1],[23,0,23,1],[24,2,24,3],[25,2,25,3],[26,0,26,1],[12,0,12,1],[4,2,4,3],[4,4,4,5],[6,0,6,1],[6,2,6,5],[7,0,7,1],[37,0,37,1],[39,0,39,1],[44,2,44,3],[45,2,45,3],[46,2,46,3],[43,0,43,5],[39,2,39,5],[41,0,41,1],[41,2,41,3],[41,4,41,5],[47,2,47,3],[44,4,44,5],[45,4,45,5],[46,4,46,5],[47,4,47,5],[14,2,14,3],[57,0,57,1],[62,0,62,1],[98,0,98,5],[40,2,40,3],[40,4,40,5],[42,0,42,1],[42,2,42,3],[42,4,42,5],[50,2,50,3],[51,2,51,3],[52,2,52,3],[53,2,53,3],[48,2,48,3],[49,0,49,5],[54,2,54,3]]}
["Envelope Requirements Summary, Part 1",null,null,null,null,"ENV-REQ"]
[{"$f":"ReadMe!A2","v":"2015 Seattle Energy Code Compliance Forms for Commercial Buildings including R2, R3, & R4 over 3 stories and all R1 "},null,null,null,null,{"$f":"ReadMe!B3","v":"Revised Aug 2019"}]
["Minimum Requirements"]
["for Prescriptive Compliance"]
[null,"Prescriptive Path"," Table C402.1.3 Notes 1,7\nInsulation Minimum R-Value",null,"Table C402.1.4 Notes 1,2\nAssembly Maximum U-factor"]
[null,"Occupancy Group  ","All Other","Group R","All Other","Group R"]
["Opaque Elements"]
["Roofs"]
[null,"Insulation Entirely above Deck","R-38 c.i.","R-38 c.i.","U-0.027","U-0.027"]
[null,"Metal Building (with thermal spacer block) Note 3","R-25 + R-22 Ls","R-25 + R-22 Ls","U-0.027","U-0.027"]
[null,"Attic and Other","R-49","R-49","U-0.021","U-0.021"]
[null,"Joist or single rafter","R-49","R-49","U-0.027","U-0.027"]
["Walls, Above-grade"]
[null,"Mass","Exterior R-16 c.i. Note 6,or\nInterior R-13 + R6 c.i. wood stud, or\nInterior R-13+R-10 c.i. metal stud",null,"U-0.057","U-0.057"]
[null,"Mass transfer deck slab edge","No R-Value for prescriptive compliance",null,"U-0.200","U-0.200"]
[null,"Metal Building","R-19 c.i., or R-13 + R-13 c.i.",null,"U-0.052","U-0.052"]
[null,"Steel Framed","R-13 + R-10c.i.","R-19 + R-8.5 c.i.","U-0.055","U-0.055"]
[null,"Wood Framed and Other","R-13 + R-7.5 c.i.","R-21 w/ int. frame","U-0.051","U-0.054"]
["Below Grade Wall Note 4",null,"Exterior: R-10 c.i.\nInterior: R-19 wood stud, or\nR-13 +R-6 c.i. metal stud",null,"U-0.070","U-0.070"]
["Floors"]
{"$rows_left_out":80}
{"sheet":"ENV-PRESCRIPTIVE","index":4,"n_rows":139,"n_cols":13,"rows_kept":139,"cut":false,"hidden":false,"merged":[[110,3,110,5],[110,6,110,7],[9,3,9,5],[9,6,9,7],[63,3,63,5],[63,6,63,7],[78,3,78,5],[78,6,78,7]]}
["Prescriptive Path, pg. 1",null,null,null,null,null,null,"ENV-PRESCRIPTIVE"]
[{"$f":"'ENV-SUM'!A2","v":"2015 Seattle Energy Code Compliance Forms for Commercial Buildings including R2, R3, & R4 over 3 stories and all R1 "},null,null,null,null,null,null,{"$f":"'ENV-SUM'!G2","v":"Revised Aug 2019"}]
[{"$f":"'ENV-SUM'!B3","v":"Project Title:"},null,null,{"$f":"IF('PROJ-SUM'!$D$3=\"1 - This title will copy onto other forms\",\"1 - Fill this line out on PROJ-SUM\",'PROJ-SUM'!$D$3)","v":"1 - Fill this line out on PROJ-SUM"},null,null,"Date",{"$f":"TEXT('PROJ-SUM'!$F$3,\"mm/dd/yyyy\")","v":"01/01/2019"}]
["Target Insulation Allowance:",null,null,null,null,null,"For SDCI Use"]
[null,{"$f":"IF(CompliancePath<>2,\"Component Performance Not Selected\",IF(CalcType=1,\"Fully Conditioned Space - Commercial, Group R, Mixed Use\",IF(CalcType=2,\"Semi-heated Space\",IF(CalcType=3,\"Refrigerated Cooler - See note 11 on ENV-UA\",IF(CalcType=4,\"Refrigerated Freezer - See note 12 on ENV-UA\",\"\")))))","v":"Component Performance Not Selected"}]
["Fenestration Area as % gross above-grade wall area",null,null,{"$f":"IF('ENV-SUM'!E33>0,'ENV-SUM'!E33,0)","v":""},"Max. Target:",{"$f":"'Target Area Adjustments'!D17","v":0.3}]
["Skylight Area as % gross roof area",null,null,{"$f":"IF('ENV-SUM'!G33>0,'ENV-SUM'!G33,0)","v":""},"Max. Target:",{"$f":"'Target Area Adjustments'!D73","v":0.05}]
["Vertical Fenestration Alternates:",null,null,null,null,{"$f":"'TA1'!A28","v":"None Selected on ENV-SUM"},"User Note"]
[]
["Building Component ",null,null,"R-Value Method for Prescriptive Compliance",null,null,"U-Factor/F-Factor Method for Prescriptive Compliance"]
[null,null,"Provide plan/detail # of assembly and description","Cavity Ins.\nR-Value","Continuous Ins. (CI)\nR-Value1","% Area of Metal Penetrations \nin CI2","Assembly \nU-Factor","U-Factor Source3                                                       "]
[]
[]
[null,null,null,null,null,null,null,null,null,null,null,null,0]
[]
[]
[]
[]
[]
[null,null,null,null,null,null,null,null,null,null,null,null,0]
{"$rows_left_out":120}
{"sheet":"ENV-UA","index":5,"n_rows":123,"n_cols":13,"rows_kept":123,"cut":false,"hidden":false,"merged":[[81,2,81,4],[76,2,76,4],[77,2,77,4],[78,2,78,4],[80,2,80,4],[79,2,79,4],[92,2,92,4],[82,2,82,4],[83,2,83,4],[84,2,84,4],[85,2,85,4],[86,2,86,4],[87,2,87,4],[88,2,88,4],[89,2,89,4],[90,2,90,4],[91,2,91,4],[99,2,99,4],[100,2,100,4],[101,2,101,4],[93,2,93,4],[94,2,94,4],[95,2,95,4],[96,2,96,4],[97,2,97,4],[98,2,98,4],[119,10,119,11],[120,10,120,11],[121,10,121,11],[122,10,122,11],[10,9,11,9],[10,10,11,11],[116,10,116,11],[117,10,117,11],[118,10,118,11]]}
["Component Performance Path, pg. 1",null,null,null,null,null,null,null,null,null,null,"ENV-UA"]
[{"$f":"'ENV-SUM'!A2","v":"2015 Seattle Energy Code Compliance Forms for Commercial Buildings including R2, R3, & R4 over 3 stories and all R1 "},null,null,null,null,null,null,null,null,null,null,{"$f":"'ENV-SUM'!G2","v":"Revised Aug 2019"}]
[{"$f":"'ENV-SUM'!B3","v":"Project Title:"},null,null,null,null,{"$f":"IF('PROJ-SUM'!$D$3=\"1 - This title will copy onto other forms\",\"1 - Fill this line out on PROJ-SUM\",'PROJ-SUM'!$D$3)","v":"1 - Fill this line out on PROJ-SUM"},null,null,null,"Date",{"$f":"TEXT('PROJ-SUM'!$F$3,\"mm/dd/yyyy\")","v":"01/01/2019"}]
["Target Insulation Allowance:",null,null,null,null,null,null,null,null,"For SDCI Use"]
[null,null,null,{"$f":"IF(CompliancePath<>2,\"Component Performance Not Selected\",IF(CalcType=1,\"Fully Conditioned Space - Commercial, Group R, Mixed Use\",IF(CalcType=2,\"Semi-heated Space\",IF(CalcType=3,\"Refrigerated Cooler - See note 11 on ENV-UA\",IF(CalcType=4,\"Refrigerated Freezer - See note 12 on ENV-UA\",\"\")))))","v":"Component Performance Not Selected"}]
["Calculation Adjustments"]
[null,null,null,{"$f":"IF(ChangeofUseOrConditioning,IF(C406.8_Enhanced_Envelope,\"Proposed UA shall be at least 5% lower than Target UA\",\"Proposed UA is allowed to be 10% higher than Target UA\"),IF(C406.8_Enhanced_Envelope,IF(SecC411_Exception3,\"Proposed UA shall be at least 30% lower than Target UA\",\"Proposed UA shall be at least 15% lower than Target UA\"),IF(SecC411_Exception3,\"Proposed UA shall be at least 15% lower than Target UA\",\"None Applied\")))","v":"None Applied"}]
["Fenestration Area as % gross above-grade wall area",null,null,null,null,null,{"$f":"IF('ENV-SUM'!E33>0,'ENV-SUM'!E33,0)","v":""},"Max. Target:",{"$f":"'Target Area Adjustments'!D17","v":0.3}]
["Skylight Area as % gross roof area",null,null,null,null,null,{"$f":"IF('ENV-SUM'!G33>0,'ENV-SUM'!G33,0)","v":""},"Max. Target:",{"$f":"'Target Area Adjustments'!D73","v":0.05}]
["Vertical Fenestration Alternates:",null,null,null,null,null,null,null,{"$f":"'TA1'!A28","v":"None Selected on ENV-SUM"}]
[null,null,null,null,null,"Vertical Fenestration",null,"Net Wall ",null,"User Note"]
[null,null,null,null,null,"Skylights",null,"Net Roof "]
["Envelope Component ",null,null,null,null,null,null,"Proposed UA",null,"Target UA"]
[null,null,null,"Cavity+CI ","Plan/Detail #","U-factor Source & Table # 2","U-factor","x Area (A)","= UA (U x A)","U-factor","x Area (A) =","UA (U x A)"]
[null,null,"R=",null,null,null,null,null,{"$f":"IF(AND(G15=0,H15=0),0,IF(OR(G15=0,H15=0),NA(), H15*G15))","v":0},{"$f":"'TA1'!F131","v":2.7E-2},{"$f":"'Target Area Adjustments'!J90","v":0},{"$f":"IF(TYPE(J15*K15)<>1,0,J15*K15)","v":0}]
[null,null,"R=",null,null,null,null,null,0,"Above Deck Insulation",null,{"$f":"'TA1'!F164","v":"U-0.027"}]
[null,null,"R=",null,null,null,null,null,{"$f":"IF(AND(G17=0,H17=0),0,IF(OR(G17=0,H17=0),NA(), H17*G17))","v":0},null,null,null,0]
[null,null,"R=",null,null,null,null,null,0,{"$f":"'TA1'!F132","v":2.7E-2},{"$f":"'Target Area Adjustments'!J91","v":0},{"$f":"IF(TYPE(J18*K18)<>1,0,J18*K18)","v":0}]
[null,null,"R=",null,null,null,null,null,0,"Metal Building",null,{"$f":"'TA1'!F165","v":"U-0.027"}]
[null,null,"R=",null,null,null,null,null,0,null,null,null,0]
{"$rows_left_out":104}
{"sheet":"TA1","index":6,"n_rows":183,"n_cols":47,"rows_kept":183,"cut":false,"hidden":true,"merged":[]}
["HARD CODED -- NOT SET on ENV-SUM or ENV-PROJ"]
[{"$f":"IF(OR(CalcType=3,CalcType=4),2,1)","v":1},"Calculation Group: 1=Building, 2=Refrigeration"]
[4,"Climate Zone: 1= Zone 4c/5, 2=Zone 6, 3=Cleared, 4= Seattle "]
[]
["Transfer Variables - DO NOT CHANGE CELL ADDRESS - hard coded in VB "]
[{"$f":"'Target Area Adjustments'!F12","v":0},"Window Area"]
[{"$f":"'Target Area Adjustments'!L12","v":0},"Net AG Wall Area"]
[{"$f":"'Target Area Adjustments'!F69","v":0},"Skylight Area"]
[{"$f":"'Target Area Adjustments'!H69","v":0},"Net Ceiling Area"]
[{"$f":"'Target Area Adjustments'!F13","v":0},"Existing Window Area"]
[{"$f":"'Target Area Adjustments'!L13","v":0},"Existing Net AG Wall Area"]
[{"$f":"'Target Area Adjustments'!F70","v":0},"Existing Skylight Area"]
[{"$f":"'Target Area Adjustments'!H70","v":0},"Existing Net Ceiling Area"]
[]
["Flags from Env-Sum Options"]
[false,"New building ","NOT USED"]
[false,"Addition","NOT USED"]
[false,"Alteration","NOT USED"]
[false,"Window WWR unchanged"]
[false,"Skylight SRR unchanged"]
{"$rows_left_out":164}
{"sheet":"Target Area Adjustments","index":7,"n_rows":95,"n_cols":12,"rows_kept":95,"cut":false,"hidden":false,"merged":[[74,9,75,9],[66,4,67,5]]}
[null,"Vertical Fenestration Target Area Adjustment Calculations"]
[]
[]
[]
[null,null,"VF = Vertical fenestration (exclude SLG)",null,null,null,"NW = Net above grade wall including opaque doors (excludes fenestration)"]
[null,null,"SG = Exempt Single Glazing",null,null,null,"Gross Exterior Above-Grade Wall Area= VF + NW"]
[null,null,"AG = Above-grade wall (exclude SLW)",null,null,null,"DR = Opaque doors ( NOT USED IN CITY FORM - Include area with net wall)"]
[null,null,"SLW = Street level gross wall below ceiling ",null,null,null,"SLG = Area of window in Street level qualified wall "]
[null,null,null,"  height and 20' per C402.3.1",null,null,"SLT = Window area transferred to Street Level Retail wall from other areas"]
[]
[null,"Proposed Areas",null,null,null,"Vertical Fenestration",null,"Exempt Single Glaze",null,"Street Level \nRetail Transfer",null,"Net Above Grade Wall"]
[null,null,null,"Project Areas ->","VF=",{"$f":"IF(ComponentPath=1,EnvSumTotWin-EnvSumExmptSngl,SUM('ENV-UA'!H84:H98))","v":0},"SG=",{"$f":"EnvSumExmptSngl","v":0},"SLT=",{"$f":"SLRtransfer","v":"n/a"},"NW=",{"$f":"IF(ComponentPath=1,EnvSumNetWall,SUM('ENV-UA'!H27:H44)+SUM('ENV-UA'!H78:H83))","v":0}]
[null,null,null,"Existing Non-project Areas ->","VF=",{"$f":"IF(ComponentPath=1,EnvSumTotWinExisting,'ENV-UA'!G11)","v":0},null,null,null,null,"NW=",{"$f":"IF(ComponentPath=1,EnvSumNetWallExisting,'ENV-UA'!I11)","v":0}]
[]
[null,"Maximum Target Vertical Fenestration Calculation"]
[null,"Gross Exterior AG Wall Area",null,"Max Vert. Fen. %\n(C402.3.1)",null,null,null,"Maximum Target Vert. Fen. Area"]
[null,{"$f":"(SUM(F12:H13,L12:L13))","v":0},"x",{"$f":"'TA1'!F151","v":0.3},"¸",100,"=",{"$f":"B17*D17","v":0}]
[]
[]
[null,"Base Target Vert. Fen. Area",null,"Window area transferred to Street Level Retail (SLT)",null,"Maximum Target Vert. Fen. Area",null,"Gross Exterior AG Wall",null,"Maximum Target Vert. Fen %"]
{"$rows_left_out":76}
{"sheet":"ENV-SHGC","index":8,"n_rows":54,"n_cols":14,"rows_kept":54,"cut":false,"hidden":false,"merged":[[22,6,23,6],[38,6,39,6],[13,1,13,3],[14,1,14,3],[15,1,15,3],[16,1,16,3],[17,1,17,3]]}
["SHGC Calculation",null,null,null,null,null,null,null,null,"ENV-SHGC"]
[{"$f":"'ENV-SUM'!A2","v":"2015 Seattle Energy Code Compliance Forms for Commercial Buildings including R2, R3, & R4 over 3 stories and all R1 "},null,null,null,null,null,null,null,null,{"$f":"'ENV-SUM'!G2","v":"Revised Aug 2019"}]
[{"$f":"'ENV-SUM'!B3","v":"Project Title:"},null,{"$f":"IF('PROJ-SUM'!$D$3=\"1 - This title will copy onto other forms\",\"1 - Fill this line out on PROJ-SUM\",'PROJ-SUM'!$D$3)","v":"1 - Fill this line out on PROJ-SUM"},null,null,null,null,"Date",{"$f":"TEXT('PROJ-SUM'!$F$3,\"mm/dd/yyyy\")","v":"01/01/2019"}]
["Target Insulation Allowance:",null,null,null,null,null,null,"For SDCI Use"]
[null,{"$f":"IF(CompliancePath<>2,\"Component Performance Not Selected\",IF(CalcType=1,\"Fully Conditioned Space - Commercial, Group R, Mixed Use\",IF(CalcType=2,\"Semi-heated Space\",IF(CalcType=3,\"Refrigerated Cooler - See note 11 on ENV-UA\",IF(CalcType=4,\"Refrigerated Freezer - See note 12 on ENV-UA\",\"\")))))","v":"Component Performance Not Selected"}]
["Fenestration Area as % gross above-grade wall area",null,null,null,{"$f":"IF('ENV-SUM'!E33>0,'ENV-SUM'!E33,0)","v":""},null,{"$f":"'Target Area Adjustments'!D17","v":0.3}]
["Skylight Area as % gross roof area",null,null,null,{"$f":"IF('ENV-SUM'!G33>0,'ENV-SUM'!G33,0)","v":""},null,{"$f":"'Target Area Adjustments'!D73","v":0.05}]
["Vertical Fenestration Alternates:",null,null,null,null,null,{"$f":"'TA1'!A28","v":"None Selected on ENV-SUM"}]
[]
[null,null,null,null,null,null,null,"User Note"]
[]
["  Skylights",null,null,null,null,"Proposed SHGC",null,"Target SHGC"]
["Sch. ID ","Provide SHGC source and fenestration schedule ID",null,null,"SHGC","x Area (A)","= SHGC x A","SHGC","x Area (A) =","SHGC x A"]
[null,null,null,null,null,null,{"$f":"IF(AND(F14=0,E14=0),0,IF(OR(F14=0,E14=0),NA(),F14*E14))","v":0},{"$f":"'TA1'!AA127","v":0.32},{"$f":"'Target Area Adjustments'!J88","v":0},{"$f":"IF(TYPE(H14*I14)<>1,0,H14*I14)","v":0}]
[null,null,null,null,null,null,{"$f":"IF(AND(F15=0,E15=0),0,IF(OR(F15=0,E15=0),NA(),F15*E15))","v":0},"SHGC",null,{"$f":"'TA1'!AA156","v":"0.32"}]
[null,null,null,null,null,null,{"$f":"IF(AND(F16=0,E16=0),0,IF(OR(F16=0,E16=0),NA(),F16*E16))","v":0}]
[null,null,null,null,null,null,{"$f":"IF(AND(F17=0,E17=0),0,IF(OR(F17=0,E17=0),NA(),F17*E17))","v":0}]
[null,null,null,null,null,null,{"$f":"IF(AND(F18=0,E18=0),0,IF(OR(F18=0,E18=0),NA(),F18*E18))","v":0},null,null,null,null,null,0]
[null,null,null,null,"Skylight Totals",{"$f":"SUM(F13:F18)","v":0},{"$f":"SUM(G13:G18)","v":0},null,{"$f":"SUM(I13:I18)","v":0},{"$f":"SUM(J13:J18)","v":0}]
[]
{"$rows_left_out":35}
{"sheet":"ENV-CHK","index":9,"n_rows":126,"n_cols":6,"rows_kept":126,"cut":false,"hidden":false,"merged":[[12,7,14,7],[20,0,21,0],[20,1,21,1],[20,2,21,2],[16,2,17,2],[16,0,17,0],[16,1,17,1],[12,0,14,0],[12,1,14,1],[12,2,14,2],[93,1,96,1],[84,1,85,1],[29,0,34,0],[29,1,34,1],[29,2,34,2],[70,1,74,1],[70,2,74,2],[40,0,42,0],[40,2,42,2],[51,2,54,2],[61,2,63,2],[55,2,56,2],[51,1,54,1],[51,0,54,0],[70,0,74,0],[43,0,45,0],[86,2,87,2],[86,1,87,1],[82,2,83,2],[80,0,81,0],[119,0,119,5],[104,2,105,2],[93,2,96,2],[89,0,92,0],[89,1,92,1],[89,2,92,2],[104,0,105,0],[104,1,105,1],[84,0,85,0],[82,0,83,0],[86,0,87,0],[93,0,96,0],[80,1,81,1],[80,2,81,2],[84,2,85,2],[82,1,83,1],[78,0,79,0],[3,0,3,5],[78,2,79,2],[22,0,27,0],[46,2,48,2],[46,1,48,1],[22,1,27,1],[22,2,27,2],[40,1,42,1],[78,1,79,1],[55,0,56,0],[61,0,63,0],[46,0,48,0],[61,1,63,1],[55,1,56,1],[43,1,45,1],[43,2,45,2]]}
["Building Permit Plans Checklist, pg. 1",null,null,null,null,"ENV-CHK"]
[{"$f":"ReadMe!A2","v":"2015 Seattle Energy Code Compliance Forms for Commercial Buildings including R2, R3, & R4 over 3 stories and all R1 "},null,null,null,null,{"$f":"ReadMe!B3","v":"Revised Aug 2019"}]
["Project Title:",null,{"$f":"IF('PROJ-SUM'!$D$3=\"1 - This title will copy onto other forms\",\"1 - Fill this line out on PROJ-SUM\",'PROJ-SUM'!$D$3)","v":"1 - Fill this line out on PROJ-SUM"},null,"Date",{"$f":"'ENV-SUM'!G3","v":"01/01/2019"}]
["The following information is necessary to check a building permit application for compliance with the building envelope requirements in the Seattle Energy Code, Commercial Provisions."]
["Applicability\n(yes,no,na)","Code Section","Component","Compliance information required in permit documents","Location in Documents","SDCI Notes"]
["SCOPE "]
[null,"C402.1.1","Low energy spaces","Low energy spaces are identified on plans; include project information, and calculations if applicable, that demonstrate spaces are eligible for envelope provisions exemption"]
[null,"C402.1.1.1","Semi-heated spaces","Semi-heated spaces are identified on plans, include calculations that demonstrate spaces are eligible for wall insulation exemption"]
[null,"C402.1.2","Equipment Buildings","Provide building area, average wall and roof U-factor, and installed equipment information that demonstrates equipment building is eligible for envelope provision exemption"]
[null,"C410.2","Walk-in and warehouse cooler and freezer spaces","Cooler and freezer spaces are identified on plans; C410 envelope compliance forms provided (pending)"]
[null,"C101.4.1","Mixed occupancy","Identify boundaries of spaces with different occupancy requirements on plans"]
[null,"C503.2","Change of space conditioning","Identify on plans existing unconditioned spaces changing to semi-heated or conditioned space, and existing semi-heated spaces changing to conditioned space; also identify heated but not cooled space larger than 2000 SF changing to both heated and cooled; provide calculations for existing and final level of space conditioning, and calculations that demonstrate alteration complies with current SEC"]
[null,"C505.1","Change of occupancy","Identify on plans existing F, S and U-occupancy spaces undergoing a change in occupancy; provide calculations that demonstrate alteration complies with the current SEC","."]
[null,null,null,"Identify on plans pre-2002 Group R spaces undergoing a change to a commercial occupancy; provide calculations that demonstrate alteration complies with the current SEC"]
[null,null,null,"Identify on plans non-Group R occupancy spaces undergoing a change to Group R; provide calculations that demonstrate alteration complies with the current SEC"]
["ENVELOPE PROVISIONS"]
[null,"C103.2\nC103.6.3","Compliance documentation","Indicate envelope insulation compliance path and provide applicable forms; ENV-PRESCRIPTIVE or ENV-UA / ENV-SHGC for component performance"]
[null,null,null,"If complying via total building performance, provide a list of all proposed envelope component types, areas and U-values"]
[null,"C303.1.1\nC303.1.2","Insulation identification","Indicate identification mark shall be applied to all insulation materials and insulation installed such that the mark is readily observable during inspection"]
[null,"C303.1.3\nC402.4.3","Fenestration product rating","Fenestration products shall be labeled with rated U-factor, SHGC, VT, and  leakage rating"]
{"$rows_left_out":106}