{"text_format":"1","workbook":"xlsx","n_sheets":9,"sheets":["ReadMe","ENV-SUM","ENV-UA","TargetArea1","ENV-SHGC","ENV-VT","ENV-CHK","Sheet1","temp"],"not_rendered":{"charts":0,"images":4,"macros":1,"external_links":0,"defined_names":57,"comments":1,"pivot_tables":0},"unopened":[],"bounds":{"document_bytes":16777216,"sheet_cells":100000,"rows_first":2000,"rows_last":500,"rows_between":2000,"halvings":0,"cell_chars":16384,"cell_head_chars":4096},"cells_cut":0,"cells_raw":0,"read":"whole","date_system":"1900"}

{"sheet":"ReadMe","index":0,"n_rows":38,"n_cols":3,"rows_kept":38,"cut":false,"hidden":false,"merged":[]}
["Instructions for Electronic Forms"]
["2009 Seattle Energy Code Compliance Forms for Nonresidential and Multifamily Residential"]
[null,"Revised September 2011"]
[null,"     Chapters 11-16 of the 2009 Seattle Energy Code apply to all nonresidential occupancies and to all multifamily residential occupancies except those within the scope of the IRC (single family residential, duplexes, attached townhouses)."]
["Intro","     This file, 2009sec-ENV.XLS, has electronic compliance forms for Chapter 13 envelop provisions for Climate Zones 1 and 2.  There are two companion files: 2009sec-MECH.XLS (Chapter 14 mechanical systems requirements); and 2009sec-LTG.XLS (Chapter 15 lighting, motor, and transformer requirements)."]
[null,"     This form is a compliance aid and is not a substitute for the full energy code text or specific jusidiction compliance requirements.  In particular, this form is not to be used for cold storage areas.  Users should refer to the code text and contact the local jurisdiction for complete information.  The 2009 Seattle Energy code text is available for download at:"]
[null,"www.seattle.gov/dpd/energy"]
[null,"The 2009 Washington State Energy code text is available for download at:"]
[null,"www.ga.wa.gov/sbcc"]
["Start-up","     Open a working copy of this file and be sure to use Save As to save it to a new file name.  Alternatively, you can save the file as a template in the XLSTART subdirectory in the EXCEL directory, and open new copies with the \"File New\" menu command. Look for \"2009sec-ENV\"."]
["Overview","      This workbook file contains multiple worksheets.  Each worksheet is indicated by a tab at the bottom of the screen.  (If you don't see the tabs, visit menu option \"Tools-Options-View-Sheet Tabs\".)  You may visit each form by clicking on its tab.  "]
[null,"      Most calculations are automated.  The spaces which display the results of calculations are not editable.  Some adjustments to formatting have been made to facilitate electronic filling and calculation of the forms. "]
["Save Files","      Each time you open this file and start filling forms, you must save it under a new filename of your choosing using File Save As.  The original template file cannot be altered.  You may also save your own versions of the forms this way."]
["Getting Around","Each form has two pages (front and back).  Both pages are available on screen when you click the tab for a form.  Use the scroll bars to find the second page.  It is either to the right, below, or sometimes to the right and below the first page."]
["Filling Fields","      All project info and the date for all forms is entered once on \"ENV-SUM\" and automatically reproduced on the other forms. Always fill in the heading of ENV-SUM, even if you will not be using that form.  The other forms have a reminder to do this."]
[null,"      Only fillable fields are accessible.  If you try to edit any other field, you'll get an error message.  You may use the TAB key to move to the next fillable field.  If the TAB doesn't take you where you want to go, use the mouse.     "]
[null,"      Avoid excessively long text strings when entering information.  In some cases, text that extends beyond the available space will simply not be seen.  In most cases, the text will wrap within the cell.  This may force part of the form onto a new page"]
[null,"      To enter the date, use this format: mm/dd/yyyy.  For example, you would enter 6/8/2006 or 12/21/2012."]
[null,"     Check boxes can be either blank, or checked-off with an \"x\" shown in the box.  To toggle between cases, click the box with your mouse.  Radio buttons  (circles) are either filled or unfilled.  Only one in a set may be filled."]
[null,"     Drop-down lists have an arrow at the right side of the space.  Click the arrow with your mouse and select the appropriate option.  One of the options is a blank."]
{"$rows_left_out":19}
{"sheet":"ENV-SUM","index":1,"n_rows":39,"n_cols":13,"rows_kept":39,"cut":false,"hidden":false,"merged":[[16,0,17,1],[16,2,17,6]]}
["Envelope Summary",null,null,null,{"$f":"TargetArea1!$B$71","v":""},null,"ENV-SUM",null,"Envelope Summary (back)",null,null,{"$f":"TargetArea1!$B$71","v":""},"ENV-SUM"]
[{"$f":"ReadMe!A2","v":"2009 Seattle Energy Code Compliance Forms for Nonresidential and Multifamily Residential"},null,null,null,null,null,{"$f":"ReadMe!B3","v":"Revised September 2011"},null,{"$f":"A2","v":"2009 Seattle Energy Code Compliance Forms for Nonresidential and Multifamily Residential"},null,null,null,{"$f":"G2","v":"Revised September 2011"}]
["Project Info","Project Address","1 - Always fill out this line on ENV-SUM1",null,null,"Date",{"$f":"TODAY()","v":"2013-11-15"},null,"Minimum Requirements"]
[null,null,"2 - Fill out this line on ENV-SUM1",null,null,"For Building Department Use",null,null,"for Prescriptive Option"]
[null,null,"3 - Fill out this line on ENV-SUM1"]
[null,"Applicant Name:","4 - Fill out this line on ENV-SUM1"]
[null,"Applicant Address:","5 - Fill out this line on ENV-SUM1"]
[null,"Applicant Phone:","6 - Fill out this line on ENV-SUM1"]
[]
["Project Description"]
[]
["Compliance Option"]
[]
["Occupancy Group"]
["r",null,"Total Fenestration\n(rough opening)\n(vertical & overhd)","divided by","Gross Exterior\nWall Area","\ntimes 100 equals","\n% Fenestration"]
[null,null,{"$f":"TargetArea1!A21","v":0},"¸",{"$f":"TargetArea1!A13","v":0},"X 100 =",{"$f":"IF(E16>0,C16/E16,0)","v":0}]
["Semi-Heated Path"]
[]
[]
["Envelope Requirements (enter values as applicable)",null,null,null,"Envelope Requirements ( continued )"]
{"$rows_left_out":20}
{"sheet":"ENV-UA","index":2,"n_rows":112,"n_cols":12,"rows_kept":112,"cut":false,"hidden":false,"merged":[]}
["Envelope UA Calculations",null,null,null,null,null,null,null,null,{"$f":"TargetArea1!$B$71","v":""},null,"ENV-UA"]
[{"$f":"'ENV-SUM'!A2","v":"2009 Seattle Energy Code Compliance Forms for Nonresidential and Multifamily Residential"},null,null,null,null,null,null,null,null,{"$f":"'ENV-SUM'!E2","v":0},null,{"$f":"'ENV-SUM'!G2","v":"Revised September 2011"}]
[{"$f":"'ENV-SUM'!B3","v":"Project Address"},null,null,null,null,{"$f":"'ENV-SUM'!$C$3","v":"1 - Always fill out this line on ENV-SUM1"},null,null,null,"Date",{"$f":"TEXT('ENV-SUM'!$G$3,\"mm/dd/yyyy\")","v":"11/15/2013"}]
["Occupancy Group",null,null,null,null,null,null,null,null,"For Building Department Use"]
["Fenestration Area as % gross exterior wall area",null,null,null,null,null,{"$f":"IF('ENV-SUM'!G16>0,'ENV-SUM'!G16,0)","v":0},"Max. Target:",{"$f":"TargetArea1!C13","v":0}]
[]
["Building Component ",null,null,null,null,null,null,"Proposed UA",null,"Target UA"]
[null,null,"Provide assembly ID & page/plan # for each bldg. element",null,null,null,"U-factor","x Area (A)","= UA (U x A)","U-factor","x Area (A) =","UA (U x A)"]
[null,null,"R=",null,"ID:",null,null,null,{"$f":"H9*G9","v":0},{"$f":"TargetArea1!T79","v":0},{"$f":"SUM(H9:H11)","v":0},{"$f":"IF(TYPE(J9*K9)<>1,0,J9*K9)","v":0}]
[null,null,"R=",null,"ID:",null,null,null,0,"Above Deck Insulation",null,{"$f":"TargetArea1!T111","v":"set occ."}]
[null,null,"R=",null,"ID:",null,null,null,0]
[null,null,"R=",null,"ID:",null,null,null,0,{"$f":"TargetArea1!T80","v":0},{"$f":"SUM(H12:H14)","v":0},{"$f":"IF(TYPE(J12*K12)<>1,0,J12*K12)","v":0}]
[null,null,"R=",null,"ID:",null,null,null,0,"Metal Building",null,{"$f":"TargetArea1!T112","v":"set occ."}]
[null,null,"R=",null,"ID:",null,null,null,0]
[null,null,"R=",null,"ID:",null,null,null,0,{"$f":"TargetArea1!T81","v":0},{"$f":"SUM(H15:H17)","v":0},{"$f":"IF(TYPE(J15*K15)<>1,0,J15*K15)","v":0}]
[null,null,"R=",null,"ID:",null,null,null,0,"Single rafter",null,{"$f":"TargetArea1!T113","v":"set occ."}]
[null,null,"R=",null,"ID:",null,null,null,0]
[null,null,"R=",null,"ID:",null,null,null,0,{"$f":"TargetArea1!T82","v":0},{"$f":"SUM(H18:H20)","v":0},{"$f":"IF(TYPE(J18*K18)<>1,0,J18*K18)","v":0}]
[null,null,"R=",null,"ID:",null,null,null,0,"Attic, other",null,{"$f":"TargetArea1!T114","v":"set occ."}]
[null,null,"R=",null,"ID:",null,null,null,0]
{"$rows_left_out":93}
{"sheet":"TargetArea1","index":3,"n_rows":138,"n_cols":54,"rows_kept":138,"cut":false,"hidden":true,"merged":[]}
[]
[]
["Target Area Adjustment Calculations    All Climates"]
[]
[]
[]
[null,null,null,"Proposed Areas"]
[null,null,null,"Above Grade Walls",null,null,"Doors & BG Walls"]
["Fenestration ->","SKY=",{"$f":"SUM('ENV-UA'!H88:H95)","v":0},"VF=",{"$f":"SUM('ENV-UA'!H76:H87,'ENV-UA'!H111)","v":0},null,"0"]
["Opaque ->",null,null,"NW=",{"$f":"SUM('ENV-UA'!H21:H35)","v":0},"DBG=",{"$f":"SUM('ENV-UA'!H36:H38)+SUM('ENV-UA'!H70:H75)","v":0}]
[]
["Gross Exterior Wall Area",null,"Max Fenestration %\n(Table 13-1)",null,null,null,"Maximum Target Fenestration Area"]
[{"$f":"(SUM(E9:G10))","v":0},"x",{"$f":"T99","v":0},"¸",100,"=",{"$f":"A13*C13","v":0}]
[]
[]
["Total Fenestration",null,null,null,"Excess Fenestration",null,"0",null,"Excess Fenestration"]
[{"$f":"C9+E9","v":0},"-",{"$f":"G13","v":0},"=",{"$f":"A17-C17","v":0},"-","ô lesser","=",{"$f":"MAX(0,G18)","v":0}]
[null,null,null,null,null,null,{"$f":"E17","v":0}]
[]
["Total Fenestration",null,"Excess Fenestration",null,"Target Fenestration",null,"Total Fenestration",null,"Target Fen. Multiplier",null,null,null,null,null,null,null,"This whole look up is current only used by seattle but the functionality is preserved incase some future code varies the u-value by glass area."]
{"$rows_left_out":119}
{"sheet":"ENV-SHGC","index":4,"n_rows":59,"n_cols":15,"rows_kept":59,"cut":false,"hidden":false,"merged":[[46,3,46,4],[45,2,45,3]]}
["SHGC Calculation",null,null,null,null,null,null,{"$f":"TargetArea1!$B$71","v":""},null,null,"ENV-SHGC"]
[{"$f":"'ENV-SUM'!A2","v":"2009 Seattle Energy Code Compliance Forms for Nonresidential and Multifamily Residential"},null,null,null,null,null,null,null,null,null,{"$f":"'ENV-SUM'!G2","v":"Revised September 2011"}]
[{"$f":"'ENV-SUM'!B3","v":"Project Address"},null,null,{"$f":"'ENV-SUM'!$C$3","v":"1 - Always fill out this line on ENV-SUM1"},null,null,null,null,"Date",{"$f":"TEXT('ENV-SUM'!$G$3,\"mm/dd/yyyy\")","v":"11/15/2013"}]
["Fenestration Area as % gross exterior wall area",null,null,null,null,{"$f":"IF('ENV-SUM'!G16>0,'ENV-SUM'!G16,0)","v":0},{"$f":"TargetArea1!C13","v":0},null,"For Building Department Use"]
["Prescriptive PF Credit"]
["Vertical North Facing Credit (1323.3 Exp. 2 )"]
[]
[]
["  Skylights",null,null,null,null,null,"Proposed SHGC",null,"Target SHGC",null,null,null,null,"\n"]
["  List ID & page #, NFRC or glass only",null,null,null,null,"SHGC*","x Area (A)","= SHGC x A","SHGC","x Area (A) =","SHGC x A"]
["  ID:",null,null,null,null,null,null,{"$f":"IF(G11=\"\",0,G11*F11)","v":0},{"$f":"TargetArea1!AK74","v":0},{"$f":"TargetArea1!I51","v":0},{"$f":"IF(TYPE(I11*J11)<>1,0,I11*J11)","v":0}]
["  ID:",null,null,null,null,null,null,{"$f":"IF(G12=\"\",0,G12*F12)","v":0},"Criteria",null,"SHGC"]
["  ID:",null,null,null,null,null,null,{"$f":"IF(G13=\"\",0,G13*F13)","v":0},"All",null,{"$f":"TargetArea1!AK106","v":"set occ."}]
["  ID:",null,null,null,null,null,null,{"$f":"IF(G14=\"\",0,G14*F14)","v":0}]
["  ID:",null,null,null,null,null,null,{"$f":"IF(G15=\"\",0,G15*F15)","v":0}]
[null,null,null,null,null,"Totals",{"$f":"SUM(G10:G15)","v":0},{"$f":"SUM(H10:H15)","v":0},"Totals",{"$f":"J11","v":0},{"$f":"K11","v":0}]
[null,null,null,null,null,null,null,null,null,null,{"$f":"IF(Occupancy=2,IF(H16>K16+0.00001,\"AVERAGE SKYLIGHT SHGC DOES NOT COMPLY\",\"\"),\"\")","v":""}]
[null,null,null,null,null,null,null,null,null,null,{"$f":"IF(ABS(G16+G53-TargetArea1!C9)>0.1,IF((G16+G53)>TargetArea1!C9,CONCATENATE(\"MORE PROPOSED SKYLIGHT IN G16 & G53 THAN ENV-UA - Remove  \",TEXT(TargetArea1!C9-(G16+G53),\"0.0\")),CONCATENATE(\"LESS PROPOSED SKYLIGHT IN G16 & G53 THAN ENV-UA - ADD  \",TEXT(TargetArea1!C9-(G16+G53),\"0.0\" )) ),\" \")","v":" "}]
[{"$f":"IF(TargetArea1!A66=2,\" Vertical Fenestration - No Residential SHGC Requirement\",\" All Non-North Vertical Fenestration++\")","v":" All Non-North Vertical Fenestration++"},null,null,null,null,null,"Proposed SHGC",null,"Target SHGC"]
["  List ID & page #, NFRC or glass only",null,"SHGC+","PF","PF \nMult*","Adjusted SHGC","x Area (A)","= SHGC x A","SHGC","x Area (A) =","SHGC x A"]
{"$rows_left_out":40}
{"sheet":"ENV-VT","index":5,"n_rows":21,"n_cols":8,"rows_kept":21,"cut":false,"hidden":false,"merged":[[20,0,20,7]]}
["VT Calculation",null,null,null,{"$f":"TargetArea1!$B$71","v":""},null,null,"ENV-VT"]
[{"$f":"'ENV-SUM'!A2","v":"2009 Seattle Energy Code Compliance Forms for Nonresidential and Multifamily Residential"},null,null,null,null,null,null,{"$f":"'ENV-SUM'!G2","v":"Revised September 2011"}]
[{"$f":"'ENV-SUM'!B3","v":"Project Address"},null,{"$f":"'ENV-SUM'!$C$3","v":"1 - Always fill out this line on ENV-SUM1"},null,null,"Date",{"$f":"TEXT('ENV-SUM'!$G$3,\"mm/dd/yyyy\")","v":"11/15/2013"}]
["Fenestration Area as % gross exterior wall area",null,{"$f":"IF('ENV-SUM'!G16>0,'ENV-SUM'!G16,0)","v":0},{"$f":"TargetArea1!C13","v":0},null,"For Building Department Use"]
[]
[]
[{"$f":"IF(Occupancy=2,\"NO MULTIFAMILY RESIDENTIAL REQUIREMENTS\",\"All Vertical Fenestration\")","v":"All Vertical Fenestration"},null,null,"Proposed VT",null,"Target VT"]
["  List ID & page #, NFRC or glass only",null,"VT","x Area (A)","= VT x A","VT","x Area (A) =","VT x A"]
["  ID:",null,null,null,{"$f":"IF(C9=\"\",0,D9*C9)","v":0},{"$f":"IF(G9=0,0,0.51)","v":0},{"$f":"TargetArea1!$I$56","v":0},{"$f":"IF(TYPE(F9*G9)<>1,0,F9*G9)","v":0}]
["  ID:",null,null,null,{"$f":"IF(C10=\"\",0,D10*C10)","v":0},"Criteria",null,"VT"]
["  ID:",null,null,null,0,"All",null,{"$f":"IF(OR(Occupancy<>1,C4<=0.3),\"No Requirements\",0.51)","v":"No Requirements"}]
["  ID:",null,null,null,0]
["  ID:",null,null,null,0]
["  ID:",null,null,null,0]
["  ID:",null,null,null,0]
["  ID:",null,null,null,0]
["  ID:",null,null,null,0]
["  ID:",null,null,null,0]
[]
[null,null,"Totals",{"$f":"SUM(D8:D18)","v":0},{"$f":"SUM(E8:E18)","v":0},"Totals",{"$f":"G9","v":0},{"$f":"H9","v":0}]
{"$rows_left_out":2}
{"sheet":"ENV-CHK","index":6,"n_rows":83,"n_cols":17,"rows_kept":83,"cut":false,"hidden":false,"merged":[[18,14,18,15]]}
["Building Permit Plans Checklist",null,null,null,null,null,null,"ENV-CHK",null,"ENV-UA INSTRUCTIONS & EXAMPLES",null,null,null,null,null,null,"ENV-CHK"]
[{"$f":"'ENV-SUM'!A2","v":"2009 Seattle Energy Code Compliance Forms for Nonresidential and Multifamily Residential"},null,null,null,null,null,null,{"$f":"'ENV-SUM'!G2","v":"Revised September 2011"},null,{"$f":"A2","v":"2009 Seattle Energy Code Compliance Forms for Nonresidential and Multifamily Residential"},null,null,null,null,null,null,{"$f":"H2","v":"Revised September 2011"}]
["Project Address",null,null,null,{"$f":"'ENV-SUM'!C3","v":"1 - Always fill out this line on ENV-SUM1"},null,"Date",{"$f":"'ENV-SUM'!G3","v":"2013-11-15"}]
[]
["Applicability",null,null,"Code",null,null,"Location","Building Department"]
["(yes,no,na)",null,null,"Section","Component","Information Required","on Plans","Notes"]
["GENERAL REQUIREMENTS (Sections 1301-1314)"]
[null,null,null,1301,"Scope","Unconditioned spaces identified on plans if allowed"]
[{"$f":"IF(C9=1,\"  Yes\",IF(C9=2,\"  No\",IF(C9=3,\"  N.A.\",\"\")))","v":""},null,4,1310.2,"Semi-heated spaces","Semi-heated spaces identified on plans if allowed"]
[{"$f":"IF(C10=1,\"  Yes\",IF(C10=2,\"  No\",IF(C10=3,\"  N.A.\",\"\")))","v":""},null,4,1310.3,"Cold Storage / refrigerated ","All refrigerated spaces identified on plans.  ENV-RFG  completed."]
[null,null,null,1311,"Insulation"]
[{"$f":"IF(C12=1,\"  Yes\",IF(C12=2,\"  No\",IF(C12=3,\"  N.A.\",\"\")))","v":""},null,4,1311.1,"General installation","Indicate installation nethod, densities and clearances to achieve "]
[null,null,null,null,null,"     intended R-value of all insulation materials"]
[{"$f":"IF(C14=1,\"  Yes\",IF(C14=2,\"  No\",IF(C14=3,\"  N.A.\",\"\")))","v":""},null,4,1311.2,"Roof /ceiling insul.","Indicate R-value on roof sections for attics and other roofs;  "]
[null,null,null,null,null,"Indicate clearances for attic insulation;"]
[null,null,null,null,null,"Indicate baffles if eave vents installed;"]
[null,null,null,null,null,"Indicate face stapling of faced batts"]
[{"$f":"IF(C18=1,\"  Yes\",IF(C18=2,\"  No\",IF(C18=3,\"  N.A.\",\"\")))","v":""},null,4,1311.3,"Wall insulation","Indicate R-value and framing material on wall sections;  "]
[null,null,null,null,null,"Indicate face stapling of faced batts;",null,null,null,null,"Building Component ",null,null,null,"Proposed UA",null,"Typical Example"]
[null,null,null,null,null,"Indicate above grade exterior insulation is protected;",null,null,null,null,"List ID & page #, code table # or calculation page #",null,null,null,"U-factor","x Area (A)"]
{"$rows_left_out":64}
{"sheet":"Sheet1","index":7,"n_rows":65,"n_cols":6,"rows_kept":65,"cut":false,"hidden":true,"merged":[[41,1,41,5],[42,2,42,5],[53,1,53,5],[0,2,0,3],[0,4,0,5]]}
[null,null,"Nonresidential",null,"Residential, Other than Single-Family"]
[null,"Opaque Elements","Assembly","Insulation","Assembly","Insulation"]
[null,null,"Max. U-factor","Min. R-Value","Max. U-factor","Min. R-Value"]
[null,"Roofs"]
[null,"Insulation entirely above deck","U-0.026","R-38 c.i.","U-0.031","R-38 c.i."]
[null,"Metal building","U-0.027","R-25 + R-11 + R-11 Ls","U-0.031","R-25 + R-11 Ls"]
[null,"Single-rafter","U-0.027","R-38","U-0.027","R-38"]
[null,"Attic and other","U-0.027","R-38 adv or R-49","U-0.027","R-38 adv or R-49"]
[null,"Walls, Above Grade"]
[null,"Mass w/ exterior & integral insulation (includes peripheral edges of intermediate floor slabs and columns)","U-0.057","a. R-16 c.i.","U-0.090","R-11.4 c.i."]
[null,null,null,"b. R-20 insulation with < 0.04% Mp"]
[null,null,null,"c. R-24 insulation with > 0.04% and < 0.08% Mp"]
[null,"Mass w/ interior insulation","U-0.056 ","d. R-13 cavity insulation + R-6 c.i. wood studs; or ","U-0.090","R-11.4 c.i."]
[null,"(includes peripheral edges of intermediate floor slabs and columns)",null,"e. R-13 cavity insulation + R-10 c.i. metal studs; or "]
[null,null,null,"f. R-22.4 insulation held solely by 1-in metal clips."]
[null,"Metal building","U-0.052","R-13 + R-13 c.i","U-0.057","R-19 + R-8.5 c.i."]
[null,"Steel framed","U-0.055","a. R-13 cavity + R-10 c.i.","U-0.057","R-19 + R-8.5 c.i."]
[null,null,null,"b. R-13 cavity + R-12.5 insulation with < 0.04% Mp."]
[null,null,null,"c. R-13 cavity + R-15 insulation with"]
[null,null,null,"> 0.04% and < 0.08% Mp."]
{"$rows_left_out":46}
{"sheet":"temp","index":8,"n_rows":35,"n_cols":1,"rows_kept":35,"cut":false,"hidden":true,"merged":[]}
[4]
[4]
[4]
[4]
[4]
[4]
[4]
[4]
[4]
[4]
[4]
[4]
[4]
[4]
[4]
[4]
[4]
[4]
[4]
[4]
{"$rows_left_out":15}